{"text_format":"1","workbook":"xlsx","n_sheets":7,"sheets":["Inicio ","C-020","C-021","C-266","C-267","C-268","C-269"],"not_rendered":{"charts":0,"images":11,"macros":1,"external_links":2,"defined_names":14,"comments":0,"pivot_tables":0},"unopened":[],"bounds":{"document_bytes":16777216,"sheet_cells":100000,"rows_first":2000,"rows_last":500,"rows_between":2000,"halvings":0,"cell_chars":16384,"cell_head_chars":4096},"cells_cut":0,"cells_raw":0,"read":"whole","date_system":"1900"}

{"sheet":"Inicio ","index":0,"n_rows":104,"n_cols":10,"rows_kept":104,"cut":false,"hidden":false,"merged":[[5,1,5,12],[13,1,13,12],[1,1,3,2],[1,3,1,8],[1,9,1,10],[1,11,3,12],[2,3,2,8],[2,9,2,10],[3,3,3,8],[3,9,3,10],[102,3,102,4],[102,5,102,6],[101,3,101,4],[101,5,101,6],[100,3,100,10],[101,7,101,10],[102,7,102,10],[103,3,103,4],[103,5,103,6],[103,7,103,10]]}
[]
[null,null,null,"HOJA DE VIDA DE INDICADOR",null,null,null,null,null,"Código:  GI-GUI-002-FR-004"]
[null,null,null,"Macroproceso: Direccionamiento Estratégico",null,null,null,null,null,"Versión: 03"]
[null,null,null,"Proceso: Gestión Integrada",null,null,null,null,null,"Fecha de Aprobación: 14/06/2019"]
[]
[null,"Listado de Indicadores del Proceso"]
[]
[]
[]
[]
[]
[]
[]
[null,"Seleccione el indicador de su interés dando clic en el icono               :"]
[]
[]
[]
[]
[]
[]
{"$rows_left_out":85}
{"sheet":"C-020","index":1,"n_rows":76,"n_cols":13,"rows_kept":76,"cut":false,"hidden":false,"merged":[[76,1,78,2],[76,3,78,5],[76,6,78,8],[76,9,78,12],[73,2,73,4],[73,6,73,8],[73,10,73,12],[74,1,74,12],[75,1,75,2],[75,3,75,5],[75,6,75,8],[75,9,75,12],[71,2,71,4],[71,6,71,8],[71,10,71,12],[72,2,72,4],[72,6,72,8],[72,10,72,12],[68,1,68,3],[68,4,68,6],[68,7,68,9],[68,10,68,12],[69,1,69,12],[70,1,70,4],[70,5,70,8],[70,9,70,12],[60,2,60,12],[61,1,61,12],[62,1,65,12],[66,1,66,12],[67,1,67,3],[67,4,67,6],[67,7,67,9],[67,10,67,12],[54,2,54,12],[55,2,55,12],[56,2,56,12],[57,2,57,12],[58,2,58,12],[59,2,59,12],[46,12,47,12],[47,5,47,7],[48,1,48,12],[49,1,51,12],[52,1,52,12],[53,2,53,12],[44,8,47,8],[44,9,44,11],[45,5,45,7],[45,9,45,11],[46,5,46,7],[46,9,47,11],[40,1,40,12],[41,1,41,4],[41,5,41,12],[42,1,47,3],[42,5,42,7],[42,8,43,8],[42,9,42,11],[43,5,43,7],[43,9,43,11],[44,5,44,7],[36,11,36,12],[37,1,39,2],[37,3,39,4],[37,5,39,6],[37,7,39,8],[37,9,39,10],[37,11,39,12],[34,1,34,2],[34,4,34,5],[34,6,34,12],[35,1,35,6],[35,7,35,12],[36,1,36,2],[36,3,36,4],[36,5,36,6],[36,7,36,8],[36,9,36,10],[30,1,31,5],[30,6,31,8],[30,9,31,12],[32,1,32,12],[33,1,33,2],[33,4,33,5],[33,7,33,8],[33,10,33,11],[23,11,25,12],[26,1,26,12],[27,1,27,5],[27,6,27,8],[27,9,27,12],[28,1,29,5],[28,6,29,8],[28,9,29,12],[20,1,20,12],[21,1,22,5],[21,6,22,7],[21,8,21,10],[21,11,22,12],[23,1,25,5],[23,6,25,7],[23,8,25,8],[23,9,25,9],[23,10,25,10],[14,1,14,2],[14,3,14,6],[14,7,14,12],[15,1,19,2],[15,3,19,6],[15,7,19,12],[9,1,9,2],[9,3,9,12],[10,1,10,12],[11,1,11,3],[11,7,11,9],[13,1,13,12],[4,1,4,12],[5,1,5,12],[7,1,7,12],[8,1,8,2],[8,3,8,8],[8,9,8,10],[8,11,8,12],[1,1,3,2],[1,3,1,8],[1,9,1,10],[1,11,3,12],[2,3,2,8],[2,9,2,10],[3,3,3,8],[3,9,3,10]]}
[]
[null,null,null,"FORMATO: HOJA DE VIDA DEL INDICADOR",null,null,null,null,null,"Código:  GI-GUI-002-FR-004"]
[null,null,null,"Macroproceso: Direccionamiento Estratégico",null,null,null,null,null,"Versión: 02"]
[null,null,null,"Proceso: Gestión Integrada",null,null,null,null,null,"Fecha de Aprobación: 17/09/2014\n"]
[]
[null,"HOJA DE VIDA DEL INDICADOR"]
[]
[null,"DESCRIPCIÓN DEL INDICADOR"]
[null,"Nombre:",null,"Porcentaje  de avance en la producción de libros y revistas",null,null,null,null,null,"Código:",null,"C-020"]
[null,"Objetivo:",null,"Realizar actividades orientadas a aumentar el numero de publicaciones de libros y revistas"]
[]
[null,"Fecha de Creación",null,null,19,12,2017,"Fecha de Actualización",null,null,19,12,2017]
[]
[null," DESCRIPCIÓN DEL PROCESO"]
[null,"PROCESO",null,"OBJETIVO DEL PROCESO",null,null,null,"ALINEADO AL OBJETIVO DE LA POLÍTICA DEL PLAN ESTRATÉGICO"]
[null,"Comunicaciones",null,"Garantizar el eficaz tratamiento de la  información  y  la comunicación institucional a través del Sistema Integrado de Comunicaciones para visibilizar las funciones universitarias en todo contexto.",null,null,null,"Política 4: Modernización de la gestión administrativa, financiera y del talento humano, dentro del marco del Plan Estratégico de Desarrollo 2008-2016"]
[]
[]
[]
[]
{"$rows_left_out":57}
{"sheet":"C-021","index":2,"n_rows":76,"n_cols":13,"rows_kept":76,"cut":false,"hidden":false,"merged":[[76,1,78,2],[76,3,78,5],[76,6,78,8],[76,9,78,12],[73,2,73,4],[73,6,73,8],[73,10,73,12],[74,1,74,12],[75,1,75,2],[75,3,75,5],[75,6,75,8],[75,9,75,12],[71,2,71,4],[71,6,71,8],[71,10,71,12],[72,2,72,4],[72,6,72,8],[72,10,72,12],[68,1,68,3],[68,4,68,6],[68,7,68,9],[68,10,68,12],[69,1,69,12],[70,1,70,4],[70,5,70,8],[70,9,70,12],[60,2,60,12],[61,1,61,12],[62,1,65,12],[66,1,66,12],[67,1,67,3],[67,4,67,6],[67,7,67,9],[67,10,67,12],[54,2,54,12],[55,2,55,12],[56,2,56,12],[57,2,57,12],[58,2,58,12],[59,2,59,12],[46,12,47,12],[47,5,47,7],[48,1,48,12],[49,1,51,12],[52,1,52,12],[53,2,53,12],[44,8,47,8],[44,9,44,11],[45,5,45,7],[45,9,45,11],[46,5,46,7],[46,9,47,11],[40,1,40,12],[41,1,41,4],[41,5,41,12],[42,1,47,3],[42,5,42,7],[42,8,43,8],[42,9,42,11],[43,5,43,7],[43,9,43,11],[44,5,44,7],[36,11,36,12],[37,1,39,2],[37,3,39,4],[37,5,39,6],[37,7,39,8],[37,9,39,10],[37,11,39,12],[34,1,34,2],[34,4,34,5],[34,6,34,12],[35,1,35,6],[35,7,35,12],[36,1,36,2],[36,3,36,4],[36,5,36,6],[36,7,36,8],[36,9,36,10],[30,1,31,5],[30,6,31,8],[30,9,31,12],[32,1,32,12],[33,1,33,2],[33,4,33,5],[33,7,33,8],[33,10,33,11],[23,11,25,12],[26,1,26,12],[27,1,27,5],[27,6,27,8],[27,9,27,12],[28,1,29,5],[28,6,29,8],[28,9,29,12],[20,1,20,12],[21,1,22,5],[21,6,22,7],[21,8,21,10],[21,11,22,12],[23,1,25,5],[23,6,25,7],[23,8,25,8],[23,9,25,9],[23,10,25,10],[14,1,14,2],[14,3,14,6],[14,7,14,12],[15,1,19,2],[15,3,19,6],[15,7,19,12],[9,1,9,2],[9,3,9,12],[10,1,10,12],[11,1,11,3],[11,7,11,9],[13,1,13,12],[4,1,4,12],[5,1,5,12],[7,1,7,12],[8,1,8,2],[8,3,8,8],[8,9,8,10],[8,11,8,12],[1,1,3,2],[1,3,1,8],[1,9,1,10],[1,11,3,12],[2,3,2,8],[2,9,2,10],[3,3,3,8],[3,9,3,10]]}
[]
[null,null,null,"FORMATO: HOJA DE VIDA DEL INDICADOR",null,null,null,null,null,"Código:  GI-GUI-002-FR-004"]
[null,null,null,"Macroproceso: Direccionamiento Estratégico",null,null,null,null,null,"Versión: 02"]
[null,null,null,"Proceso: Gestión Integrada",null,null,null,null,null,"Fecha de Aprobación: 17/09/2014"]
[]
[null,"HOJA DE VIDA DEL INDICADOR"]
[]
[null,"DESCRIPCIÓN DEL INDICADOR"]
[null,"Nombre:",null,"Porcentaje de avance en el diseño, elaboración y producción de material publicitario institucional y papeleria.",null,null,null,null,null,"Código:",null,"C-021"]
[null,"Objetivo:",null,"Diseñar, elaborar y producir matrial publicitario institucional y papelería para las diferentes dependencias y facultades de la universidad."]
[]
[null,"Fecha de Creación",null,null,19,12,2017,"Fecha de Actualización",null,null,19,12,2017]
[]
[null," DESCRIPCIÓN DEL PROCESO"]
[null,"PROCESO",null,"OBJETIVO DEL PROCESO",null,null,null,"ALINEADO AL OBJETIVO DE LA POLÍTICA DEL PLAN ESTRATÉGICO"]
[null,"Comunicaciones",null,"Garantizar el eficaz tratamiento de la  información  y  la comunicación institucional a través del Sistema Integrado de Comunicaciones para visibilizar las funciones universitarias en todo contexto.",null,null,null,"Política 4: Modernización de la gestión administrativa, financiera y del talento humano, dentro del marco del Plan Estratégico de Desarrollo 2008-2016"]
[]
[]
[]
[]
{"$rows_left_out":57}
{"sheet":"C-266","index":3,"n_rows":60,"n_cols":15,"rows_kept":60,"cut":false,"hidden":false,"merged":[[57,1,57,12],[58,1,58,2],[58,3,58,5],[58,6,58,8],[58,9,58,12],[59,1,60,2],[59,3,60,5],[59,6,60,8],[59,9,60,12],[55,2,55,4],[55,6,55,8],[55,10,55,12],[56,2,56,4],[56,6,56,8],[56,10,56,12],[52,1,52,12],[53,1,53,4],[53,5,53,8],[53,9,53,12],[54,2,54,4],[54,6,54,8],[54,10,54,12],[50,1,50,3],[50,4,50,6],[50,7,50,9],[50,10,50,12],[51,1,51,3],[51,4,51,6],[51,7,51,9],[51,10,51,12],[44,1,44,12],[45,1,45,12],[46,1,46,12],[47,1,47,12],[48,1,48,12],[49,1,49,12],[38,2,38,12],[39,2,39,12],[40,2,40,12],[41,2,41,12],[42,2,42,12],[43,1,43,12],[32,1,32,12],[33,1,33,12],[34,1,34,12],[35,2,35,12],[36,2,36,12],[37,2,37,12],[30,1,31,2],[30,3,31,4],[30,5,31,6],[30,7,30,9],[30,10,30,12],[31,10,31,12],[28,1,28,6],[28,7,28,9],[28,10,28,12],[29,1,29,2],[29,3,29,4],[29,5,29,6],[29,7,29,9],[29,10,29,12],[24,1,25,5],[24,6,25,8],[24,9,25,12],[26,1,27,5],[26,6,27,8],[26,9,27,12],[20,1,20,12],[21,1,21,5],[21,6,21,8],[21,9,21,12],[22,1,23,5],[22,6,23,8],[22,9,23,12],[14,1,14,12],[15,1,16,5],[15,6,16,8],[15,9,16,10],[15,11,16,12],[17,1,19,5],[17,6,19,8],[17,11,19,12],[10,1,11,2],[10,3,10,4],[10,5,10,12],[11,3,11,4],[11,5,11,12],[12,1,13,2],[12,3,12,4],[12,5,12,12],[13,3,13,4],[13,5,13,12],[7,1,7,2],[7,3,7,8],[7,9,7,10],[7,11,7,12],[8,1,8,12],[9,1,9,2],[9,3,9,8],[9,9,9,10],[9,11,9,12],[4,1,4,12],[5,1,5,12],[6,1,6,2],[6,3,6,8],[6,9,6,10],[6,11,6,12],[1,1,3,2],[1,3,1,8],[1,9,1,10],[1,11,3,12],[2,3,2,8],[2,9,2,10],[3,3,3,8],[3,9,3,10]]}
[null,null,null,null,null,null,null,null,null,null,null,null," "]
[null,null,null,"HOJA DE VIDA DE INDICADOR",null,null,null,null,null,"Código:  GI-GUI-002-FR-004"]
[null,null,null,"Macroproceso: Direccionamiento Estratégico",null,null,null,null,null,"Versión: 03"]
[null,null,null,"Proceso: Gestión Integrada",null,null,null,null,null,"Fecha de Aprobación: 14/06/2019"]
[]
[null,"IDENTIFICACIÓN DEL INDICADOR"]
[null,"Nombre:",null,"Noticias realizadas y publicadas en la página web de la Emisora LAUD 90.4 FM.",null,null,null,null,null,"Código:",null,"C-266"]
[null,"Objetivo:",null,"Establecer el nivel de producción de noticias de la Emisora LAUD 90.4 FM.",null,null,null,null,null,"Proceso asociado:",null,"Comunicaciones"]
[null,"ÁMBITO DEL INDICADOR"]
[null,"Tipo de Indicador:",null,null,null,null,null,null,null,"Nivel de Intervención:",null,"Producto"]
[null,"Alineación con el Plan Estratégico de Desarrollo 2018 - 2030:",null,"Lineamiento 5",null,"5.8 Implementar un sistema integrado de comunicaciones que permita gestionar, articular y medir su impacto en la publicidad, difusión, acceso y apropiación de la información para favorecer la visibilidad institucional nacional e internacionalmente.",null,null,null,null,null,null,null,null,{"$f":"IF(D11=\"Lineamiento 1\",\"UNO\",IF(D11=\"Lineamiento 2\",\"DOS\",IF(D11=\"Lineamiento 3\",\"TRES\",IF(D11=\"Lineamiento 4\",\"CUATRO\",IF(D11=\"Lineamiento 5\",\"CINCO\")))))","v":"CINCO"}]
[null,null,null,null,null,null,null,null,null,null,null,null,null,null,{"$f":"IF(D12=\"Lineamiento 1\",\"UNO\",IF(D12=\"Lineamiento 2\",\"DOS\",IF(D12=\"Lineamiento 3\",\"TRES\",IF(D12=\"Lineamiento 4\",\"CUATRO\",IF(D12=\"Lineamiento 5\",\"CINCO\")))))","v":false}]
[null,"Alineación Factor y Característica de Acreditación Institucional:",null,null,null,null,null,null,null,null,null,null,null,null,{"$f":"VLOOKUP(D13,[2]Información!$M$28:$N$39,2,FALSE)","v":{"$error":"#N/A"}}]
[null,null,null,null,null,null,null,null,null,null,null,null,null,null,{"$f":"VLOOKUP(D14,[2]Información!$M$28:$N$39,2,FALSE)","v":{"$error":"#N/A"}}]
[null," FORMA DE CÁLCULO"]
[null,"Fórmula",null,null,null,null,"Unidad de Medida",null,null,"Tendencia esperada del Indicador",null,"Meta o Valor Esperado"]
[]
[null,"Sumatoria de las noticias publicadas en la página web de la Emisora LAUD 90.4 FM en un periodo de tiempo determinado.",null,null,null,null,"Número de noticias",null,null,"              Creciente",null,"600 noticias"]
[null,null,null,null,null,null,null,null,null,"              Decreciente"]
[null,null,null,null,null,null,null,null,null,"              Estático"]
{"$rows_left_out":41}
{"sheet":"C-267","index":4,"n_rows":60,"n_cols":15,"rows_kept":60,"cut":false,"hidden":false,"merged":[[57,1,57,12],[58,1,58,2],[58,3,58,5],[58,6,58,8],[58,9,58,12],[59,1,60,2],[59,3,60,5],[59,6,60,8],[59,9,60,12],[55,2,55,4],[55,6,55,8],[55,10,55,12],[56,2,56,4],[56,6,56,8],[56,10,56,12],[52,1,52,12],[53,1,53,4],[53,5,53,8],[53,9,53,12],[54,2,54,4],[54,6,54,8],[54,10,54,12],[50,1,50,3],[50,4,50,6],[50,7,50,9],[50,10,50,12],[51,1,51,3],[51,4,51,6],[51,7,51,9],[51,10,51,12],[44,1,44,12],[45,1,45,12],[46,1,46,12],[47,1,47,12],[48,1,48,12],[49,1,49,12],[38,2,38,12],[39,2,39,12],[40,2,40,12],[41,2,41,12],[42,2,42,12],[43,1,43,12],[32,1,32,12],[33,1,33,12],[34,1,34,12],[35,2,35,12],[36,2,36,12],[37,2,37,12],[30,1,31,2],[30,3,31,4],[30,5,31,6],[30,7,30,9],[30,10,30,12],[31,10,31,12],[28,1,28,6],[28,7,28,9],[28,10,28,12],[29,1,29,2],[29,3,29,4],[29,5,29,6],[29,7,29,9],[29,10,29,12],[24,1,25,5],[24,6,25,8],[24,9,25,12],[26,1,27,5],[26,6,27,8],[26,9,27,12],[20,1,20,12],[21,1,21,5],[21,6,21,8],[21,9,21,12],[22,1,23,5],[22,6,23,8],[22,9,23,12],[14,1,14,12],[15,1,16,5],[15,6,16,8],[15,9,16,10],[15,11,16,12],[17,1,19,5],[17,6,19,8],[17,11,19,12],[10,1,11,2],[10,3,10,4],[10,5,10,12],[11,3,11,4],[11,5,11,12],[12,1,13,2],[12,3,12,4],[12,5,12,12],[13,3,13,4],[13,5,13,12],[7,1,7,2],[7,3,7,8],[7,9,7,10],[7,11,7,12],[8,1,8,12],[9,1,9,2],[9,3,9,8],[9,9,9,10],[9,11,9,12],[4,1,4,12],[5,1,5,12],[6,1,6,2],[6,3,6,8],[6,9,6,10],[6,11,6,12],[1,1,3,2],[1,3,1,8],[1,9,1,10],[1,11,3,12],[2,3,2,8],[2,9,2,10],[3,3,3,8],[3,9,3,10]]}
[null,null,null,null,null,null,null,null,null,null,null,null," "]
[null,null,null,"HOJA DE VIDA DE INDICADOR",null,null,null,null,null,"Código:  GI-GUI-002-FR-004"]
[null,null,null,"Macroproceso: Direccionamiento Estratégico",null,null,null,null,null,"Versión: 03"]
[null,null,null,"Proceso: Gestión Integrada",null,null,null,null,null,"Fecha de Aprobación: 14/06/2019"]
[]
[null,"IDENTIFICACIÓN DEL INDICADOR"]
[null,"Nombre:",null,"Cuñas realizadas y difundidas a través de la Emisora LAUD 90.4 FM en relación con la Universidad Distrital",null,null,null,null,null,"Código:",null,"C-267"]
[null,"Objetivo:",null,"Establecer el nivel de producción de cuñas relacionadas con la promoción de programas académicos y eventos culturales y académicos de la Universidad Distrital.",null,null,null,null,null,"Proceso asociado:",null,"Comunicaciones"]
[null,"ÁMBITO DEL INDICADOR"]
[null,"Tipo de Indicador:",null,null,null,null,null,null,null,"Nivel de Intervención:",null,"Producto"]
[null,"Alineación con el Plan Estratégico de Desarrollo 2018 - 2030:",null,"Lineamiento 5",null,"5.8 Implementar un sistema integrado de comunicaciones que permita gestionar, articular y medir su impacto en la publicidad, difusión, acceso y apropiación de la información para favorecer la visibilidad institucional nacional e internacionalmente.",null,null,null,null,null,null,null,null,{"$f":"IF(D11=\"Lineamiento 1\",\"UNO\",IF(D11=\"Lineamiento 2\",\"DOS\",IF(D11=\"Lineamiento 3\",\"TRES\",IF(D11=\"Lineamiento 4\",\"CUATRO\",IF(D11=\"Lineamiento 5\",\"CINCO\")))))","v":"CINCO"}]
[null,null,null,null,null,null,null,null,null,null,null,null,null,null,{"$f":"IF(D12=\"Lineamiento 1\",\"UNO\",IF(D12=\"Lineamiento 2\",\"DOS\",IF(D12=\"Lineamiento 3\",\"TRES\",IF(D12=\"Lineamiento 4\",\"CUATRO\",IF(D12=\"Lineamiento 5\",\"CINCO\")))))","v":false}]
[null,"Alineación Factor y Característica de Acreditación Institucional:",null,null,null,null,null,null,null,null,null,null,null,null,{"$f":"VLOOKUP(D13,[2]Información!$M$28:$N$39,2,FALSE)","v":{"$error":"#N/A"}}]
[null,null,null,null,null,null,null,null,null,null,null,null,null,null,{"$f":"VLOOKUP(D14,[2]Información!$M$28:$N$39,2,FALSE)","v":{"$error":"#N/A"}}]
[null," FORMA DE CÁLCULO"]
[null,"Fórmula",null,null,null,null,"Unidad de Medida",null,null,"Tendencia esperada del Indicador",null,"Meta o Valor Esperado"]
[]
[null,"Sumatoria de las cuñas realizadas y difundidas a través de la Emisora LAUD 90.4 FM con temas de la Universidad Distrital, en un periodo de tiempo determinado.",null,null,null,null,"Número de cuñas",null,null,"              Creciente",null,"6 cuñas "]
[null,null,null,null,null,null,null,null,null,"              Decreciente"]
[null,null,null,null,null,null,null,null,null,"              Estático"]
{"$rows_left_out":41}
{"sheet":"C-268","index":5,"n_rows":60,"n_cols":15,"rows_kept":60,"cut":false,"hidden":false,"merged":[[57,1,57,12],[58,1,58,2],[58,3,58,5],[58,6,58,8],[58,9,58,12],[59,1,60,2],[59,3,60,5],[59,6,60,8],[59,9,60,12],[55,2,55,4],[55,6,55,8],[55,10,55,12],[56,2,56,4],[56,6,56,8],[56,10,56,12],[52,1,52,12],[53,1,53,4],[53,5,53,8],[53,9,53,12],[54,2,54,4],[54,6,54,8],[54,10,54,12],[50,1,50,3],[50,4,50,6],[50,7,50,9],[50,10,50,12],[51,1,51,3],[51,4,51,6],[51,7,51,9],[51,10,51,12],[44,1,44,12],[45,1,45,12],[46,1,46,12],[47,1,47,12],[48,1,48,12],[49,1,49,12],[38,2,38,12],[39,2,39,12],[40,2,40,12],[41,2,41,12],[42,2,42,12],[43,1,43,12],[32,1,32,12],[33,1,33,12],[34,1,34,12],[35,2,35,12],[36,2,36,12],[37,2,37,12],[30,1,31,2],[30,3,31,4],[30,5,31,6],[30,7,30,9],[30,10,30,12],[31,10,31,12],[28,1,28,6],[28,7,28,9],[28,10,28,12],[29,1,29,2],[29,3,29,4],[29,5,29,6],[29,7,29,9],[29,10,29,12],[24,1,25,5],[24,6,25,8],[24,9,25,12],[26,1,27,5],[26,6,27,8],[26,9,27,12],[20,1,20,12],[21,1,21,5],[21,6,21,8],[21,9,21,12],[22,1,23,5],[22,6,23,8],[22,9,23,12],[14,1,14,12],[15,1,16,5],[15,6,16,8],[15,9,16,10],[15,11,16,12],[17,1,19,5],[17,6,19,8],[17,11,19,12],[10,1,11,2],[10,3,10,4],[10,5,10,12],[11,3,11,4],[11,5,11,12],[12,1,13,2],[12,3,12,4],[12,5,12,12],[13,3,13,4],[13,5,13,12],[7,1,7,2],[7,3,7,8],[7,9,7,10],[7,11,7,12],[8,1,8,12],[9,1,9,2],[9,3,9,8],[9,9,9,10],[9,11,9,12],[4,1,4,12],[5,1,5,12],[6,1,6,2],[6,3,6,8],[6,9,6,10],[6,11,6,12],[1,1,3,2],[1,3,1,8],[1,9,1,10],[1,11,3,12],[2,3,2,8],[2,9,2,10],[3,3,3,8],[3,9,3,10]]}
[null,null,null,null,null,null,null,null,null,null,null,null," "]
[null,null,null,"HOJA DE VIDA DE INDICADOR",null,null,null,null,null,"Código:  GI-GUI-002-FR-004"]
[null,null,null,"Macroproceso: Direccionamiento Estratégico",null,null,null,null,null,"Versión: 03"]
[null,null,null,"Proceso: Gestión Integrada",null,null,null,null,null,"Fecha de Aprobación: 14/06/2019"]
[]
[null,"IDENTIFICACIÓN DEL INDICADOR"]
[null,"Nombre:",null,"Tránsito de la página web de la Emisora LAUD 90.4 FM.",null,null,null,null,null,"Código:",null,"C-268"]
[null,"Objetivo:",null,"Establecer el número de visitas a la página web de la Emisora LAUD 90.4 FM.",null,null,null,null,null,"Proceso asociado:",null,"Comunicaciones"]
[null,"ÁMBITO DEL INDICADOR"]
[null,"Tipo de Indicador:",null,null,null,null,null,null,null,"Nivel de Intervención:",null,"Resultados"]
[null,"Alineación con el Plan Estratégico de Desarrollo 2018 - 2030:",null,"Lineamiento 5",null,"5.8 Implementar un sistema integrado de comunicaciones que permita gestionar, articular y medir su impacto en la publicidad, difusión, acceso y apropiación de la información para favorecer la visibilidad institucional nacional e internacionalmente.",null,null,null,null,null,null,null,null,{"$f":"IF(D11=\"Lineamiento 1\",\"UNO\",IF(D11=\"Lineamiento 2\",\"DOS\",IF(D11=\"Lineamiento 3\",\"TRES\",IF(D11=\"Lineamiento 4\",\"CUATRO\",IF(D11=\"Lineamiento 5\",\"CINCO\")))))","v":"CINCO"}]
[null,null,null,null,null,null,null,null,null,null,null,null,null,null,{"$f":"IF(D12=\"Lineamiento 1\",\"UNO\",IF(D12=\"Lineamiento 2\",\"DOS\",IF(D12=\"Lineamiento 3\",\"TRES\",IF(D12=\"Lineamiento 4\",\"CUATRO\",IF(D12=\"Lineamiento 5\",\"CINCO\")))))","v":false}]
[null,"Alineación Factor y Característica de Acreditación Institucional:",null,null,null,null,null,null,null,null,null,null,null,null,{"$f":"VLOOKUP(D13,[2]Información!$M$28:$N$39,2,FALSE)","v":{"$error":"#N/A"}}]
[null,null,null,null,null,null,null,null,null,null,null,null,null,null,{"$f":"VLOOKUP(D14,[2]Información!$M$28:$N$39,2,FALSE)","v":{"$error":"#N/A"}}]
[null," FORMA DE CÁLCULO"]
[null,"Fórmula",null,null,null,null,"Unidad de Medida",null,null,"Tendencia esperada del Indicador",null,"Meta o Valor Esperado"]
[]
[null,"Número de visitas a la página web de la Emisora LAUD 90.4 FM",null,null,null,null,"Número de visitas ",null,null,"              Creciente",null,"60.000 visitas a la página web"]
[null,null,null,null,null,null,null,null,null,"              Decreciente"]
[null,null,null,null,null,null,null,null,null,"              Estático"]
{"$rows_left_out":41}
{"sheet":"C-269","index":6,"n_rows":60,"n_cols":15,"rows_kept":60,"cut":false,"hidden":false,"merged":[[57,1,57,12],[58,1,58,2],[58,3,58,5],[58,6,58,8],[58,9,58,12],[59,1,60,2],[59,3,60,5],[59,6,60,8],[59,9,60,12],[55,2,55,4],[55,6,55,8],[55,10,55,12],[56,2,56,4],[56,6,56,8],[56,10,56,12],[52,1,52,12],[53,1,53,4],[53,5,53,8],[53,9,53,12],[54,2,54,4],[54,6,54,8],[54,10,54,12],[50,1,50,3],[50,4,50,6],[50,7,50,9],[50,10,50,12],[51,1,51,3],[51,4,51,6],[51,7,51,9],[51,10,51,12],[44,1,44,12],[45,1,45,12],[46,1,46,12],[47,1,47,12],[48,1,48,12],[49,1,49,12],[38,2,38,12],[39,2,39,12],[40,2,40,12],[41,2,41,12],[42,2,42,12],[43,1,43,12],[32,1,32,12],[33,1,33,12],[34,1,34,12],[35,2,35,12],[36,2,36,12],[37,2,37,12],[30,1,31,2],[30,3,31,4],[30,5,31,6],[30,7,30,9],[30,10,30,12],[31,10,31,12],[28,1,28,6],[28,7,28,9],[28,10,28,12],[29,1,29,2],[29,3,29,4],[29,5,29,6],[29,7,29,9],[29,10,29,12],[24,1,25,5],[24,6,25,8],[24,9,25,12],[26,1,27,5],[26,6,27,8],[26,9,27,12],[20,1,20,12],[21,1,21,5],[21,6,21,8],[21,9,21,12],[22,1,23,5],[22,6,23,8],[22,9,23,12],[14,1,14,12],[15,1,16,5],[15,6,16,8],[15,9,16,10],[15,11,16,12],[17,1,19,5],[17,6,19,8],[17,11,19,12],[10,1,11,2],[10,3,10,4],[10,5,10,12],[11,3,11,4],[11,5,11,12],[12,1,13,2],[12,3,12,4],[12,5,12,12],[13,3,13,4],[13,5,13,12],[7,1,7,2],[7,3,7,8],[7,9,7,10],[7,11,7,12],[8,1,8,12],[9,1,9,2],[9,3,9,8],[9,9,9,10],[9,11,9,12],[4,1,4,12],[5,1,5,12],[6,1,6,2],[6,3,6,8],[6,9,6,10],[6,11,6,12],[1,1,3,2],[1,3,1,8],[1,9,1,10],[1,11,3,12],[2,3,2,8],[2,9,2,10],[3,3,3,8],[3,9,3,10]]}
[null,null,null,null,null,null,null,null,null,null,null,null," "]
[null,null,null,"HOJA DE VIDA DE INDICADOR",null,null,null,null,null,"Código:  GI-GUI-002-FR-004"]
[null,null,null,"Macroproceso: Direccionamiento Estratégico",null,null,null,null,null,"Versión: 03"]
[null,null,null,"Proceso: Gestión Integrada",null,null,null,null,null,"Fecha de Aprobación: 14/06/2019"]
[]
[null,"IDENTIFICACIÓN DEL INDICADOR"]
[null,"Nombre:",null,"Ranking de los contenidos más vistos dentro de la página web de la Emisora LAUD 90.4 FM.",null,null,null,null,null,"Código:",null,"C-269"]
[null,"Objetivo:",null,"Establecer cuales son los contenidos de preferencia de los usuarios de la página web de la Emisora LAUD 90.4 FM.",null,null,null,null,null,"Proceso asociado:",null,"Comunicaciones"]
[null,"ÁMBITO DEL INDICADOR"]
[null,"Tipo de Indicador:",null,null,null,null,null,null,null,"Nivel de Intervención:",null,"Resultados"]
[null,"Alineación con el Plan Estratégico de Desarrollo 2018 - 2030:",null,"Lineamiento 5",null,"5.8 Implementar un sistema integrado de comunicaciones que permita gestionar, articular y medir su impacto en la publicidad, difusión, acceso y apropiación de la información para favorecer la visibilidad institucional nacional e internacionalmente.",null,null,null,null,null,null,null,null,{"$f":"IF(D11=\"Lineamiento 1\",\"UNO\",IF(D11=\"Lineamiento 2\",\"DOS\",IF(D11=\"Lineamiento 3\",\"TRES\",IF(D11=\"Lineamiento 4\",\"CUATRO\",IF(D11=\"Lineamiento 5\",\"CINCO\")))))","v":"CINCO"}]
[null,null,null,null,null,null,null,null,null,null,null,null,null,null,{"$f":"IF(D12=\"Lineamiento 1\",\"UNO\",IF(D12=\"Lineamiento 2\",\"DOS\",IF(D12=\"Lineamiento 3\",\"TRES\",IF(D12=\"Lineamiento 4\",\"CUATRO\",IF(D12=\"Lineamiento 5\",\"CINCO\")))))","v":false}]
[null,"Alineación Factor y Característica de Acreditación Institucional:",null,null,null,null,null,null,null,null,null,null,null,null,{"$f":"VLOOKUP(D13,[2]Información!$M$28:$N$39,2,FALSE)","v":{"$error":"#N/A"}}]
[null,null,null,null,null,null,null,null,null,null,null,null,null,null,{"$f":"VLOOKUP(D14,[2]Información!$M$28:$N$39,2,FALSE)","v":{"$error":"#N/A"}}]
[null," FORMA DE CÁLCULO"]
[null,"Fórmula",null,null,null,null,"Unidad de Medida",null,null,"Tendencia esperada del Indicador",null,"Meta o Valor Esperado"]
[]
[null,"Listado de los 10 contenidos más vistos por los usuarios de la página web de la Emisora LAUD 90.4 FM en un periodo de tiempo determinado.",null,null,null,null,"Listado de los 10 contenidos mas vistos (cualitativa)",null,null,"              Creciente",null,"10 contenidos "]
[null,null,null,null,null,null,null,null,null,"              Decreciente"]
[null,null,null,null,null,null,null,null,null,"              Estático"]
{"$rows_left_out":40}