{"text_format":"1","workbook":"xlsx","n_sheets":9,"sheets":["Datos","Menú","SGC","SGA","SGSST","SGSI","Riesgos de Corrupción","Clasificación del Riesgo","Calificación del Control"],"not_rendered":{"charts":0,"images":2,"macros":1,"external_links":2,"defined_names":13,"comments":2,"pivot_tables":0},"unopened":[],"bounds":{"document_bytes":16777216,"sheet_cells":100000,"rows_first":2000,"rows_last":500,"rows_between":2000,"halvings":0,"cell_chars":16384,"cell_head_chars":4096},"cells_cut":0,"cells_raw":0,"read":"whole","date_system":"1900"}

{"sheet":"Datos","index":0,"n_rows":217,"n_cols":15,"rows_kept":217,"cut":false,"hidden":false,"merged":[[179,3,180,3],[179,4,180,4],[179,5,180,5],[179,6,180,6],[181,3,182,3],[181,5,182,5],[175,3,176,3],[175,4,176,4],[175,5,176,5],[175,6,176,6],[177,3,178,3],[177,4,178,4],[177,5,178,5]]}
[]
["Para Todos","PROCESO","OBJETIVO",null,"SEDE"]
[null,"Todos los Procesos","N/A",null,"Todas las Sedes"]
[null,"Planeación Estratégica e Institucional","Formular y Definir políticas institucionales mediante estrategias, programas y proyectos con el fin de dar cumplimiento a la misión, visión y objetivos institucionales.",null,"Sede Administrativa"]
[null,"Gestión Integrada","Gestionar el mejoramiento continuo de los subsistemas a través de un análisis sinérgico y permanente que contribuya al cumplimiento de los objetivos institucionales",null,"Facultad Ingeniería"]
[null,"Autoevaluación y Acreditación","Realizar de manera sistemática y permanente un análisis valorativo y autónomo que permita verificar el grado de cumplimiento de los objetivos institucionales.",null,"Facultad Ciencias y Educación - Macarena A"]
[null,"Interinstitucionalización e Internacionalización","Coordinar, las actividades de comunicación institucional interna y externa con el objeto de garantizar el conocimiento de la universidad a las partes interesadas y generar sentido de pertenencia con la institución.",null,"Facultad Ciencias y Educación - Macarena B"]
[null,"Comunicaciones","Consolidar la Interinstitucionalización e Internacionalización de la Universidad Distrital Francisco José de Caldas mediante un conjunto de acciones para el direccionamiento estratégico con variables académicas, administrativas y tecnológicas para facilitar la inmersión y participación activa de la institución en la sociedad del conocimiento en el ámbito local, nacional e internacional.",null,"Facultad de Medio Ambiente y Recursos Naturales - Vivero"]
[null,"Gestión de Docencia","Garantizar que los planes de estudio establecidos para cada proyecto curricular, ofrezcan al estudiante de la UDFJC una formación integral y de calidad, dirigida fundamentalmente a las necesidades de la sociedad, contando con la cantidad e idoneidad de docentes y demás personal que influya directamente en tal proceso de formación, garantizando que se ejecute eficientemente el proceso de enseñanza.",null,"Facultad  Tecnológica"]
[null,"Gestión de Investigación","Fomentar y desarrollar la Gestión Investigativa de alto impacto, a través de la formulación de estrategias, programas y proyectos, a fin de aportar a la consecución de los objetivos y cumplimiento de las funciones institucionales y a los fines esenciales del estado.",null,"Facultad de Artes ASAB"]
[null,"Extensión y Proyección Social","Promover la Vinculación de la Universidad Distrital Francisco José de Caldas con su Entorno social, a través de la coordinación de los programas, planes y proyectos de Extensión y Proyección Social, en articulación a la Docencia y la Investigación.",null,"Facultad de Artes ASAB - Sótanos Jimenez"]
[null,"Admisiones, Registro y Control","Garantizar que la Inscripción, Selección, Ingresos, Reingresos, Transferencias, Registro y Control de la Historia Académica de los estudiantes y egresados de la Universidad, que se lleva a cabo en los Proyectos Curriculares, se realicen bajos preceptos de Equidad y Transparencia.",null,"Academia Luis A. Calvo - ALAC"]
[null,"Bienestar Institucional","Ofrecer servicios de Bienestar Universitario mediante la ejecución de programas que permitan el mejoramiento de la calidad de vida y el desarrollo integral de la comunidad Universitaria.",null,"Posgrados de Ciencias y Educación"]
[null,"Gestión de la Información Bibliográfica","Desarrollar las actividades de soporte necesarias para llevar a cabo la Gestión de Laboratorios de la Universidad Distrital Francisco José de Caldas mediante el cumplimiento de los lineamientos y políticas institucionales establecidas, brindando así apoyo a las labores misionales.",null,"Sede Deportiva Calle 34"]
[null,"Gestión de Laboratorios","Recibir, radicar y tramitar las acciones ciudadanas (petición, queja, reclamo, derecho de petición, denuncia, sugerencia, solicitud de información o consulta) que la ciudadanía formule en el ejercicio del control social, relacionadas con el cumplimiento de la misión de la entidad, los servicios y el funcionamiento de la Universidad, siempre propendiendo garantizar la respuesta oportuna a la ciudadanía. ",null,"Emisora LAUD 90.4"]
[null,"Servicio al Ciudadano","Gestionar y proveer el acceso a fuentes de información académicas, investigativas y culturales de la comunidad universitaria, a través de recursos y servicios de información oportunos con el fin de apoyar la docencia, investigación y extensión de la comunidad universitaria y fortalecer los procesos misionales de la Universidad Distrital Francisco José de Caldas.",null,"ILUD - Calle 54"]
[null,"Gestión de los Sistemas de Información y las Telecomunicaciones","Administrar, gestionar, registrar y controlar los recursos financieros en la Universidad Distrital Francisco José Caldas, cumpliendo con el marco, constitucional, legal y normativo vigente; garantizando la transparencia y sostenibilidad financiera de acuerdo a los lineamientos establecidos en el contexto estratégico y misional de la institución. ",null,"ILUD - San Luis"]
[null,"Gestión y Desarrollo del Talento Humano","Promover Servidores Públicos altamente calificados y comprometidos con la organización creando condiciones para su bienestar, seguridad e integralidad, a través del diseño e implementación de políticas, estrategias, planes, programas y proyectos, encaminados a la consecución de los objetivos y cumplimiento de las funciones institucionales.",null,"ILUD - UGI"]
[null,"Gestión Documental","Gestionar los sistemas de información y las telecomunicaciones para asegurar el acceso, disponibilidad, confiabilidad, confidencialidad de los activos de información a través de la infraestructura y las soluciones Informáticas en el marco de la normatividad vigente aplicable, como apoyo a los procesos misionales de la Universidad.",null,"ILUD - Calle 23"]
[null,"Gestión de Infraestructura Física","Garantizar la correcta planeación, manejo, control, organización y funcionamiento de la gestión documental y la administración de las diferentes unidades documentales de la Universidad Distrital, de forma lógica de acuerdo con la naturaleza y fines de la Universidad, cumpliendo con los estándares para el tratamiento de los documentos y la legislación vigente, para proteger el patrimonio documental, preservar los archivos en las mejores condiciones de acceso y seguridad, y asegurar la disponibilidad a la academia, la comunidad en general y del mejoramiento institucional.",null,"Aduanilla de Paiba"]
[null,"Gestión de Recursos Financieros","Garantizar a través de su gestión los servicios relacionados con administración de bienes, infraestructura, planta física, mantenimiento, compras, inventarios, aseo y seguridad, requeridos para el óptimo desarrollo de las actividades académico-administrativas de la Universidad Distrital Francisco José de Caldas.",null,"Sede PORVENIR"]
[null,"Gestión Contractual","Gestionar de manera transparente y eficaz los recursos para la contratación de los bienes y/o servicios a través de los diferentes mecanismos de contratación necesarios para el cumplimiento de la misión y visión de la Universidad Distrital Francisco José de Caldas de acuerdo a los estándares y normatividad vigente.",null,"Sede IDEXUD"]
[null,"Gestión Jurídica","Ejecutar y desarrollar políticas, planes, programas y proyectos de carácter jurídico, armonizando los actos administrativos emanados por la Universidad con las leyes y la jurisprudencia vigente, llevando a cabo la representación legal, la defensa judicial, la asesoría en temas jurídicos y el apoyo a la gestión contractual, de la Universidad Distrital Francisco José de Caldas.",null,"Sede B \"Thomas Jefferson\""]
[null,"Evaluación y Control","Controlar la gestión de la Universidad en cuanto a los procedimientos internos individuales, grupales e institucionales para el cumplimiento de los objetivos y las metas de la Universidad Distrital Francisco José de Caldas.",null,"Sede Calle 42 No. 8A-80"]
[null,"Control Disciplinario","Atender y solucionar de manera imparcial los casos que presenten los funcionarios autorizados en la Universidad, referentes a conductas disciplinarias de funcionarios públicos.",null,"Sede Sección Publicaciones y Unidad de Extensión Facultad de Ciencias"]
[]
[null,"XXX"]
[null,"XXX"]
[null,"XXX"]
[null,"XXX"]
[null,"XXX"]
[null,"XXX"]
[null,"XXX"]
[null,"XXX"]
[null,"XXX"]
[null,"XXX"]
[null,"XXX"]
[null,"XXX"]
[null,"XXX"]
[null,"XXX"]
[null,"XXX"]
[null,"XXX"]
[null,"XXX"]
[null,"XXX"]
[null,"XXX"]
[null,"XXX"]
[null,"XXX"]
[null,"XXX"]
[null,"XXX"]
[]
["Subsistema de Gestión de Calidad (SGC)","CLASIFICACIÓN"]
[null,"Interno"]
[null,"Externo"]
[]
[null,"TIPO DE RIESGO"]
[null,"Estratégico"]
[null,"Imagen"]
[null,"Operativos"]
[null,"Financieros"]
[null,"De cumplimiento"]
[null,"De tecnología"]
[null,"De corrupción"]
[]
[null,"PROBABILIDAD"]
[null,"Raro - 1",null,"BAJO - TRIVIAL 1","BAJO - ACEPTABLE 2","MODERADO 3","ALTA-IMPORTANTE 4","ALTA-IMPORTANTE 5"]
[null,"Improbable - 2",null,"BAJO - TRIVIAL 2","BAJO - ACEPTABLE 4","MODERADO 6","ALTA-IMPORTANTE 8","CATASTRÓFICO – INACEPTABLE 10"]
[null,"Posible - 3",null,"BAJO - TRIVIAL 3","MODERADO 6","ALTA - IMPORTANTE 9","CATASTRÓFICO – INACEPTABLE 12","CATASTRÓFICO – INACEPTABLE 15"]
[null,"Probable - 4",null,"MODERADO 4","ALTA - IMPORTANTE 8","ALTA - IMPORTANTE 12","CATASTRÓFICO – INACEPTABLE 16","CATASTRÓFICO – INACEPTABLE 20"]
[null,"Seguro - 5",null,"ALTA - IMPORTANTE 5","ALTA - IMPORTANTE 10","CATASTRÓFICO – INACEPTABLE 15","CATASTRÓFICO – INACEPTABLE 20","CATASTRÓFICO – INACEPTABLE 25"]
[]
[null,"IMPACTO "]
[null,"Insignificante - 1"]
[null,"Menor - 2"]
[null,"Moderado - 3"]
[null,"Mayor - 4"]
[null,"Catastrófico - 5"]
[]
[null,"TIPO DE CONTROL"]
[null,"Correctivo"]
[null,"Preventivo "]
[]
[null,"NIVEL"]
[null,"Nulo - 0"]
[null,"Bajo - 5"]
[null,"Medio - 10"]
[null,"Medio - 15"]
[null,"Medio Alto - 20"]
[null,"Alto - 25"]
[]
[null,"MANEJO DEL RIESGO"]
[null,"Evitar (EV)"]
[null,"Reducir (RE)"]
[null,"Transferir (TR)"]
[null,"Asumir (AS)"]
[]
["Subsistema de Gestión Ambiental (SGA)","FACTOR DE RIESGO",null,null,null,null,null,null,null,null,null,null,null,null,"ACTIVIDADES"]
[null,"Incendio",null,null,null,null,null,null,null,null,null,null,null,null,"Manipulación de reactivos químicos (prácticas de laboratorio)"]
[null,"Explosión",null,null,null,null,null,null,null,null,null,null,null,null,"Operación de sub estación eléctrica"]
[null,"Accidentes ocupacionales",null,null,null,null,null,null,null,null,null,null,null,null,"Mantenimiento de sub estación eléctrica"]
[null,null,null,null,null,null,null,null,null,null,null,null,null,null,"Operación de equipos eléctricos y electrónicos (laboratorios)"]
[null,"PROBABILIDAD",null,null,null,null,null,null,null,null,null,null,null,null,"Operación del circuito eléctrico"]
[null,"Muy probable - 5",null,null,null,null,null,null,null,null,null,null,null,null,"Protestas estudiantiles"]
[null,"Altamente probable - 4",null,null,null,null,null,null,null,null,null,null,null,null,"Operación de estufa de gas propano"]
[null,"Probable - 3",null,null,null,null,null,null,null,null,null,null,null,null,"Mantenimiento de sub estación eléctrica"]
[null,"Posible - 2",null,null,null,null,null,null,null,null,null,null,null,null,"Manipulación de Hornos para cerámica"]
[null,"Poco probable - 1",null,null,null,null,null,null,null,null,null,null,null,null,"Manipulación de pipetas de gas propano"]
[null,null,null,null,null,null,null,null,null,null,null,null,null,null,"Mantenimiento de aire acondicionado"]
[null,"CANTIDAD",null,null,null,null,null,null,null,null,null,null,null,null,"Operación de aire acondicionado"]
[null,"Muy alta - 4",null,null,null,null,null,null,null,null,null,null,null,null,"Mantenimiento de equipos (derrames accidentales)"]
[null,"Alta - 3",null,null,null,null,null,null,null,null,null,null,null,null,"Centro de acopio para almacenamiento de residuos"]
[null,"Poca - 2",null,null,null,null,null,null,null,null,null,null,null,null,"Operación de la planta eléctrica"]
[null,"Muy poca - 1",null,null,null,null,null,null,null,null,null,null,null,null,"Operación de estufa de gas natural"]
[null,null,null,null,null,null,null,null,null,null,null,null,null,null,"Práctica académica (transformadores usados)"]
[null,"PELIGROSIDAD",null,null,null,null,null,null,null,null,null,null,null,null,"Almacenamiento de reactivos químicos"]
[null,"Muy peligrosa - 4",null,null,null,null,null,null,null,null,null,null,null,null,"Almacenamiento de residuos químicos"]
[null,"Peligrosa - 3",null,null,null,null,null,null,null,null,null,null,null,null,"Manipulación de estufas (apoyo alimentario)"]
[null,"Poco peligrosa - 2",null,null,null,null,null,null,null,null,null,null,null,null,"Operación de equipos con gas natural y gas propano"]
[null,"No peligrosa - 1",null,null,null,null,null,null,null,null,null,null,null,null,"Operación de la planta eléctrica"]
[null,null,null,null,null,null,null,null,null,null,null,null,null,null,"Centro de acopio para almacenamiento de residuos"]
[null,"EXTENSIÓN",null,null,null,null,null,null,null,null,null,null,null,null,"Manipulación y mezcla de reactivos químicos"]
[null,"Muy extenso - 4",null,null,null,null,null,null,null,null,null,null,null,null,"Manipulación de residuos químicos"]
[null,"Extenso - 3",null,null,null,null,null,null,null,null,null,null,null,null,"Operación de tanque de gas."]
[null,"Poco extenso (Emplazamiento) - 2",null,null,null,null,null,null,null,null,null,null,null,null,"Almacenamiento de pipetas en cuarto de gas."]
[null,"Puntual (Área afectada) - 1",null,null,null,null,null,null,null,null,null,null,null,null,"Almacenamiento de maderas"]
[null,null,null,null,null,null,null,null,null,null,null,null,null,null,"Manipulación y mezcla de reactivos químicos"]
[null,"POBLACIÓN AFECTADA",null,"RIESGO LEVE 3","RIESGO LEVE 4","RIESGO LEVE 5","RIESGO LEVE 6","RIESGO LEVE 7","RIESGO LEVE 8","RIESGO LEVE 9","RIESGO LEVE 10","RIESGO LEVE 11","RIESGO LEVE 12",null,"Otras"]
[null,"Muy alto - 4",null,"RIESGO LEVE 6","RIESGO LEVE 8","RIESGO LEVE 10","RIESGO LEVE 12","RIESGO LEVE 14","RIESGO LEVE 16","RIESGO LEVE 18","RIESGO LEVE 20","RIESGO MODERADO 22","RIESGO MODERADO 24"]
[null,"Alto - 3",null,"RIESGO LEVE 9","RIESGO LEVE 12","RIESGO LEVE 15","RIESGO LEVE 18","RIESGO MODERADO 21","RIESGO MODERADO 24","RIESGO MODERADO 27","RIESGO MODERADO 30","RIESGO MODERADO 33","RIESGO MODERADO 36"]
[null,"Poco - 2",null,"RIESGO LEVE 12","RIESGO LEVE 16","RIESGO LEVE 20","RIESGO MODERADO 24","RIESGO MODERADO 28","RIESGO MODERADO 32","RIESGO MODERADO 36","RIESGO MODERADO 40","RIESGO SIGNIFICATIVO 44","RIESGO SIGNIFICATIVO 48"]
[null,"Muy poco - 1",null,"RIESGO LEVE 15","RIESGO LEVE 20","RIESGO MODERADO 25","RIESGO MODERADO 30","RIESGO MODERADO 35","RIESGO MODERADO 40","RIESGO SIGNIFICATIVO 45","RIESGO SIGNIFICATIVO 50","RIESGO SIGNIFICATIVO 55","RIESGO SIGNIFICATIVO 60"]
[]
["Subsistema de Gestión de Seguridad y Salud en el Trabajo (SGSST)","¿ES RUTINARIO?"]
[null,"Sí"]
[null,"No"]
[]
[null,"CLASIFICACIÓN",null,"BIOLÓGICO","FÍSICO","QUÍMICO","PSICOSOCIAL","BIOMECÁNICOS","CONDICIONES DE SEGURIDAD","FENÓMENOS NATURALES"]
[null,"Biológico",null,"Virus","Ruido de impacto ","Polvos orgánicos","Gestión organizacional estilo de mando, ","Postura prolongada","Mecánico elementos o partes de máquinas","Sismo"]
[null,"Físico",null,"Bacterias","Ruido intermitente ","Polvos inorgánicos","Gestión organizacional pago","Postura mantenida","Mecánico herramientas, Mecánico equipos","Terremoto"]
[null,"Químico",null,"Hongos","Ruido continuo","Fibras","Gestión organizacional contratación","Postura forzada ","Mecánico piezas a trabajar","Vendaval"]
[null,"Psicosocial",null,"Ricketsias","Exceso de Iluminación","Líquidos nieblas ","Gestión organizacional participación ","Postura antigravitacional","Mecánico materiales proyectados sólidos","Inundación"]
[null,"Biomecánicos",null,"Parásitos","Deficiencia de Iluminación","Líquidos rocios","Gestión organizacional inducción y capacitación, ","Esfuerzo","Mecánico materiales proyectados sólidos fluidos","Derrumbe"]
[null,"Condiciones_de_Seguridad",null,"Picaduras","Vibración cuerpo entero ","Gases y vapores","Gestión organizacional bienestar social","Movimiento repetitivo","Eléctrico alta tensión","Precipitaciones (lluvias, granizadas, heladas)"]
[null,"Fenómenos_Naturales",null,"Mordeduras","Vibración segmentaria","Humos metálicos ","Gestión organizacional evaluación del desempeño","Manipulación manual de cargas","Eléctrico baja tensión"]
[null,null,null,"Fluidos o excrementos","Temperaturas extremo calor","Humos no metálicos","Gestión organizacional manejo de cambios",null,"Eléctrico estática"]
[null,null,null,null,"Temperaturas extremo frío","Material particulado","Características de la organización del trabajo (comunicación, tecnología, organización del trabajo, demandas cualitativas y cuantitativas de la labor",null,"Locativo sistemas y medios de almacenamiento "]
[null,null,null,null,"Radicaciones ionizantes rayos X, ",null,"Características del grupo social de trabajo relaciones",null,"Locativo  superficies de trabajo irregulares, Locativo  superficies de trabajo deslizantes"]
[null,null,null,null,"Radicaciones ionizantes rayos gama",null,"Características del grupo social de trabajo cohesión",null,"Locativo  superficies de trabajo con diferencias de nivel"]
[null,null,null,null,"Radicaciones ionizantes rayos beta",null,"Características del grupo social de trabajo calidad de interacciones",null,"Locativo condiciones de orden y aseo "]
[null,null,null,null,"Radicaciones ionizantes rayos alfa",null,"Características del grupo social de trabajo trabajo en equipo",null,"Locativo caída de objetos"]
[null,null,null,null,"Radicaciones no ionizantes laser",null,"Condiciones de la tarea carga mental",null,"Tecnológico explosión, Tecnológico fuga "]
[null,null,null,null,"Radicaciones no ionizantes ultravioleta",null,"Condiciones de la tarea contenido de la tarea",null,"Tecnológico derrame, Tecnológico incendio"]
[null,null,null,null,"Radicaciones no ionizantes  infrarroja",null,"Condiciones de la tarea demandas emocionales",null,"Accidentes de tránsito"]
[null,null,null,null,"Radicaciones no ionizantes radiofrecuencia ",null,"Condiciones de la tarea sistema de control ",null,"Públicos robos, atracos, asaltos, "]
[null,null,null,null,"Radicaciones no ionizantes microondas",null,"Condiciones de la tarea definición de roles",null,"Públicos atentados"]
[null,"N.D",null,null,null,null,"Condiciones de la tarea monotonía",null,"Públicos de orden público"]
[null,"Muy Alto (MA) - 10",null,null,null,null,"Interfase persona-tarea conocimientos, ",null,"Trabajo en alturas"]
[null,"Alto (A) - 6",null,null,null,null,"Interfase persona-tarea habilidades en relación con la demanda de la tarea",null,"Espacios confinados"]
[null,"Medio (M) - 2",null,null,null,null,"Interfase persona-tarea iniciativa"]
[null,"Bajo (B) - No se Asigna Valor",null,null,null,null,"Interfase persona-tarea autonomía y reconocimiento"]
[null,null,null,null,null,null,"Interfase persona-tarea identificación de la persona con la tarea y la organización"]
[null,"N.E",null,null,null,null,"Jornadas de trabajo pausas"]
[null,"Continua (EC) - 4 ",null,null,null,null,"Jornadas de trabajo trabajo nocturno"]
[null,"Frecuente (EF) - 3",null,null,null,null,"Jornadas de trabajo rotación"]
[null,"Ocasional (EO) - 2",null,null,null,null,"Jornadas de trabajo horas extras"]
[null,"Esporádica (EE) - 1",null,null,null,null,"Jornadas de trabajo descansos"]
[]
[null,"N.P (N.DxN.E)",null,"MUY ALTO (MA) - 40","MUY ALTO (MA) - 30","ALTO (A) - 20","ALTO (A) - 10"]
[null,null,null,"MUY ALTO (MA) - 24","ALTO (A) - 18","ALTO (A) - 12","MEDIO (M) - 6"]
[null,null,null,"MEDIO (M) - 8","MEDIO (M) - 6","BAJO (B) - 4","BAJO (B) - 2"]
[null,"N.C"]
[null,"Mortal o Catastrófico (M) - 100"]
[null,"Muy Grave (MG) - 60"]
[null,"Grave (G) - 25"]
[null,"Leve (L) - 10"]
[]
[null,"N.R (N.PxN.C)",null,"NIVEL DE RIESGO 1 (4000 - 2400)","NIVEL DE RIESGO 1 (2000 - 1200)","NIVEL DE RIESGO 1 (800 - 600)","NIVEL DE RIESGO 2 (400 - 200)"]
[]
[null,null,null,"NIVEL DE RIESGO 1 (2400- 1440)","NIVEL DE RIESGO 1 (1200 - 600)","NIVEL DE RIESGO 2 (480 - 360)","NIVEL DE RIESGO 2 (200)"]
[null,null,null,null,null,null,"NIVEL DE RIESGO 3 (120)"]
[null,null,null,"NIVEL DE RIESGO 1 (1000 - 600)","NIVEL DE RIESGO 2 (500 - 250)","NIVEL DE RIESGO 2 (200 - 150)","NIVEL DE RIESGO 3 (100 - 50)"]
[]
[null,null,null,"NIVEL DE RIESGO 2 (400-240)","NIVEL DE RIESGO 2 (200)","NIVEL DE RIESGO 3 (80 - 60)","NIVEL DE RIESGO 3 (40)"]
[null,null,null,null,"NIVEL DE RIESGO 3 (100)",null,"NIVEL DE RIESGO 4 (20)"]
[]
["Subsistema de Seguridad de la Información (SGSI)","PROBABILIDAD"]
[null,"Raro - 1",null,"BAJO - TRIVIAL 1","BAJO - ACEPTABLE 2","MODERADO 3","ALTA-IMPORTANTE 4","ALTA-IMPORTANTE 5"]
[null,"Improbable - 2",null,"BAJO - TRIVIAL 2","BAJO - ACEPTABLE 4","MODERADO 6","ALTA-IMPORTANTE 8","CATASTRÓFICO – INACEPTABLE 10"]
[null,"Posible - 3",null,"BAJO - TRIVIAL 3","MODERADO 6","ALTA - IMPORTANTE 9","CATASTRÓFICO – INACEPTABLE 12","CATASTRÓFICO – INACEPTABLE 15"]
[null,"Probable - 4",null,"MODERADO 4","ALTA - IMPORTANTE 8","ALTA - IMPORTANTE 12","CATASTRÓFICO – INACEPTABLE 16","CATASTRÓFICO – INACEPTABLE 20"]
[null,"Seguro - 5",null,"ALTA - IMPORTANTE 5","ALTA - IMPORTANTE 10","CATASTRÓFICO – INACEPTABLE 15","CATASTRÓFICO – INACEPTABLE 20","CATASTRÓFICO – INACEPTABLE 25"]
[]
[null,"IMPACTO "]
[null,"Insignificante - 1"]
[null,"Menor - 2"]
[null,"Moderado - 3"]
[null,"Mayor - 4"]
[null,"Catastrófico - 5"]
[]
[null,"TIPO DE CONTROL"]
[null,"Correctivo"]
[null,"Preventivo "]
[]
[null,"NIVEL"]
[null,"Nulo - 0"]
[null,"Bajo - 5"]
[null,"Medio - 10"]
[null,"Medio - 15"]
[null,"Medio Alto - 20"]
[null,"Alto - 25"]
[]
["Riesgos de Corrupción","PROBABILIDAD DE MATERIALIZACIÓN"]
[null,"Casi Seguro"]
[null,"Posible "]
[]
[null,"TIPO DE CONTROL"]
[null,"Correctivo"]
[null,"Preventivo "]

{"sheet":"Menú","index":1,"n_rows":12,"n_cols":4,"rows_kept":12,"cut":false,"hidden":false,"merged":[[1,1,3,1],[1,4,3,4]]}
[]
[null,null,"MATRIZ INTEGRAL DE RIESGOS ","Código: GI-GUI-002-FR-001"]
[null,null,"Macroproceso: Direccionamiento Estratégico","Versión: 01"]
[null,null,"Proceso: Gestión Integrada","Fecha de Aprobación: XX/XX/XX"]
[]
[null,null,"Seleccione el Eje a evaluar:"]
[]
[null,null,"Subsistema de Gestión de Calidad (SGC)"]
[null,null,"Subsistema de Gestión Ambiental (SGA)"]
[null,null,"Subsistema de Gestión de Seguridad y Salud en el Trabajo (SGSST)"]
[null,null,"Subsistema de Seguridad de la Información (SGSI)"]
[null,null,"Riesgos de Corrupción"]

{"sheet":"SGC","index":2,"n_rows":76,"n_cols":27,"rows_kept":76,"cut":false,"hidden":false,"merged":[[16,24,21,24],[16,25,21,25],[16,26,21,26],[22,7,27,7],[22,8,27,8],[22,9,27,9],[22,11,27,11],[22,12,27,12],[22,13,27,13],[22,21,27,21],[22,22,27,22],[22,23,27,23],[22,24,27,24],[22,25,27,25],[22,26,27,26],[16,7,21,7],[16,21,21,21],[16,22,21,22],[16,23,21,23],[22,4,22,5],[26,4,26,5],[16,8,21,8],[16,9,21,9],[16,11,21,11],[16,12,21,12],[16,13,21,13],[10,12,15,12],[10,13,15,13],[10,7,15,7],[10,4,10,5],[20,4,20,5],[21,4,21,5],[17,4,17,5],[18,4,18,5],[19,4,19,5],[14,4,14,5],[15,4,15,5],[16,4,16,5],[11,4,11,5],[12,4,12,5],[13,4,13,5],[10,26,15,26],[8,6,9,6],[8,11,9,11],[8,12,9,12],[8,13,9,13],[8,16,8,19],[7,8,9,8],[7,10,9,10],[7,11,7,13],[7,4,7,6],[8,26,9,26],[7,14,7,26],[8,20,9,20],[8,25,9,25],[8,14,9,14],[8,15,9,15],[10,21,15,21],[10,22,15,22],[10,23,15,23],[10,24,15,24],[10,25,15,25],[10,8,15,8],[10,9,15,9],[10,11,15,11],[1,1,3,1],[1,2,1,3],[1,5,3,5],[2,2,2,3],[3,2,3,3],[7,7,9,7],[7,9,9,9],[8,21,8,22],[8,23,8,24],[8,4,9,5],[27,4,27,5],[23,4,23,5],[24,4,24,5],[25,4,25,5],[7,1,9,2],[7,3,9,3],[22,1,27,2],[22,3,27,3],[10,1,15,2],[10,3,15,3],[16,1,21,2],[16,3,21,3],[28,1,33,2],[28,3,33,3],[28,4,28,5],[28,7,33,7],[28,8,33,8],[29,4,29,5],[30,4,30,5],[31,4,31,5],[32,4,32,5],[33,4,33,5],[28,22,33,22],[28,23,33,23],[28,24,33,24],[28,25,33,25],[28,26,33,26],[28,9,33,9],[28,11,33,11],[28,12,33,12],[28,13,33,13],[28,21,33,21],[34,1,39,2],[34,3,39,3],[34,4,34,5],[34,7,39,7],[34,8,39,8],[35,4,35,5],[36,4,36,5],[37,4,37,5],[38,4,38,5],[39,4,39,5],[34,22,39,22],[34,23,39,23],[34,24,39,24],[34,25,39,25],[34,26,39,26],[34,9,39,9],[34,11,39,11],[34,12,39,12],[34,13,39,13],[34,21,39,21],[40,1,45,2],[40,3,45,3],[40,4,40,5],[40,7,45,7],[40,8,45,8],[41,4,41,5],[42,4,42,5],[43,4,43,5],[44,4,44,5],[45,4,45,5],[40,22,45,22],[40,23,45,23],[40,24,45,24],[40,25,45,25],[40,26,45,26],[40,9,45,9],[40,11,45,11],[40,12,45,12],[40,13,45,13],[40,21,45,21],[46,1,51,2],[46,3,51,3],[46,4,46,5],[46,7,51,7],[46,8,51,8],[47,4,47,5],[48,4,48,5],[49,4,49,5],[50,4,50,5],[51,4,51,5],[46,22,51,22],[46,23,51,23],[46,24,51,24],[46,25,51,25],[46,26,51,26],[46,9,51,9],[46,11,51,11],[46,12,51,12],[46,13,51,13],[46,21,51,21],[52,1,57,2],[52,3,57,3],[52,4,52,5],[52,7,57,7],[52,8,57,8],[53,4,53,5],[54,4,54,5],[55,4,55,5],[56,4,56,5],[57,4,57,5],[52,22,57,22],[52,23,57,23],[52,24,57,24],[52,25,57,25],[52,26,57,26],[52,9,57,9],[52,11,57,11],[52,12,57,12],[52,13,57,13],[52,21,57,21],[58,1,63,2],[58,3,63,3],[58,4,58,5],[58,7,63,7],[58,8,63,8],[59,4,59,5],[60,4,60,5],[61,4,61,5],[62,4,62,5],[63,4,63,5],[58,22,63,22],[58,23,63,23],[58,24,63,24],[58,25,63,25],[58,26,63,26],[58,9,63,9],[58,11,63,11],[58,12,63,12],[58,13,63,13],[58,21,63,21],[64,1,69,2],[64,3,69,3],[64,4,64,5],[64,7,69,7],[64,8,69,8],[65,4,65,5],[66,4,66,5],[67,4,67,5],[68,4,68,5],[69,4,69,5],[64,22,69,22],[64,23,69,23],[64,24,69,24],[64,25,69,25],[64,26,69,26],[64,9,69,9],[64,11,69,11],[64,12,69,12],[64,13,69,13],[64,21,69,21],[70,1,75,2],[70,3,75,3],[70,4,70,5],[70,7,75,7],[70,8,75,8],[71,4,71,5],[72,4,72,5],[73,4,73,5],[74,4,74,5],[75,4,75,5],[70,22,75,22],[70,23,75,23],[70,24,75,24],[70,25,75,25],[70,26,75,26],[70,9,75,9],[70,11,75,11],[70,12,75,12],[70,13,75,13],[70,21,75,21]]}
[]
[null,null,"MATRIZ INTEGRAL DE RIESGOS ",null,"Código: GI-MG-001-FR-014"]
[null,null,"Macroproceso: Direccionamiento Estratégico",null,"Versión: 01"]
[null,null,"Proceso: Gestión Integrada",null,"Fecha de Aprobación: 29/10/2015"]
[]
[null,null,"Subsistema de Gestión de Calidad (SGC)"]
[]
[null,"PROCESO",null,"OBJETIVO DEL PROCESO  ","CONTEXTO ESTRATÉGICO",null,null,"RIESGO ","DESCRIPCIÓN","TIPO DE RIESGO","CONSECUENCIAS","CLASIFICACIÓN",null,null,"EVALUACIÓN DEL RIESGO "]
[null,null,null,null,"CAUSA O FUENTE",null,"CLASIFICACIÓN",null,null,null,null,"PROBABILIDAD","IMPACTO ","ZONA DE RIESGO","CONTROLES","TIPO DE CONTROL","NIVEL",null,null,null,"TOTAL NIVEL","PROBABILIDAD RESIDUAL",null,"IMPACTO RESIDUAL",null,"ZONA DE RIESGO RESIDUAL","MANEJO DEL RIESGO"]
[null,null,null,null,null,null,null,null,null,null,null,null,null,null,null,null,"Documentado ","Aplicación ","Efectivo","Seguimiento, evaluación y mejora ",null,"RIESGO CONTROLADO","PROBABILIDAD ","RIESGO CONTROLADO","IMPACTO"]
[null,"Extensión y Proyección Social",null,{"$f":"IF(B11=\"\",\"-\",VLOOKUP(B11,Datos!$B$4:$C$25,2,FALSE))","v":"Promover la Vinculación de la Universidad Distrital Francisco José de Caldas con su Entorno social, a través de la coordinación de los programas, planes y proyectos de Extensión y Proyección Social, en articulación a la Docencia y la Investigación."},"Falta de claridad en la delegación de  funciones ",null,"Interno","Documentación incompleta en la participación de   proyectos y convocatorias públicas ","hace referencia a la falta de información frente a la documentación a presentar en el momento de licitar, además de la provisión de los recursos para la entrega final de la propuesta.","Operativos","Pérdida de proyectos","Posible - 3","Mayor - 4",{"$f":"IF(AND(L11=Datos!$B$65,M11=Datos!$B$72),Datos!$D$65,IF(AND(L11=Datos!$B$65,M11=Datos!$B$73),Datos!$E$65,IF(AND(L11=Datos!$B$65,M11=Datos!$B$74),Datos!$F$65,IF(AND(L11=Datos!$B$65,M11=Datos!$B$75),Datos!$G$65,IF(AND(L11=Datos!$B$65,M11=Datos!$B$76),Datos!$H$65,IF(AND(L11=Datos!$B$66,M11=Datos!$B$72),Datos!$D$66,IF(AND(L11=Datos!$B$66,M11=Datos!$B$73),Datos!$E$66,IF(AND(L11=Datos!$B$66,M11=Datos!$B$74),Datos!$F$66,IF(AND(L11=Datos!$B$66,M11=Datos!$B$75),Datos!$G$66,IF(AND(L11=Datos!$B$66,M11=Datos!$B$76),Datos!$H$66,IF(AND(L11=Datos!$B$67,M11=Datos!$B$72),Datos!$D$67,IF(AND(L11=Datos!$B$67,M11=Datos!$B$73),Datos!$E$67,IF(AND(L11=Datos!$B$67,M11=Datos!$B$74),Datos!$F$67,IF(AND(L11=Datos!$B$67,M11=Datos!$B$75),Datos!$G$67,IF(AND(L11=Datos!$B$67,M11=Datos!$B$76),Datos!$H$67,IF(AND(L11=Datos!$B$68,M11=Datos!$B$72),Datos!$D$68,IF(AND(L11=Datos!$B$68,M11=Datos!$B$73),Datos!$E$68,IF(AND(L11=Datos!$B$68,M11=Datos!$B$74),Datos!$F$68,IF(AND(L11=Datos!$B$68,M11=Datos!$B$75),Datos!$G$68,IF(AND(L11=Datos!$B$68,M11=Datos!$B$76),Datos!$H$68,IF(AND(L11=Datos!$B$69,M11=Datos!$B$72),Datos!$D$69,IF(AND(L11=Datos!$B$69,M11=Datos!$B$73),Datos!$E$69,IF(AND(L11=Datos!$B$69,M11=Datos!$B$74),Datos!$F$69,IF(AND(L11=Datos!$B$69,M11=Datos!$B$75),Datos!$G$69,IF(AND(L11=Datos!$B$69,M11=Datos!$B$76),Datos!$H$69,\"-\")))))))))))))))))))))))))","v":"CATASTRÓFICO – INACEPTABLE 12"},"Creación de Formato con documentación necesaria para licitación","Correctivo","Alto - 25","Alto - 25","Medio - 15","Medio - 15",{"$f":"((IF(Q11=Datos!$B$83,0,IF(Q11=Datos!$B$84,5,IF(Q11=Datos!$B$85,10,IF(Q11=Datos!$B$86,15,IF(Q11=Datos!$B$87,20,IF(Q11=Datos!$B$88,25,0)))))))/100)+((IF(R11=Datos!$B$83,0,IF(R11=Datos!$B$84,5,IF(R11=Datos!$B$85,10,IF(R11=Datos!$B$86,15,IF(R11=Datos!$B$87,20,IF(R11=Datos!$B$88,25,0)))))))/100)+((IF(S11=Datos!$B$83,0,IF(S11=Datos!$B$84,5,IF(S11=Datos!$B$85,10,IF(S11=Datos!$B$86,15,IF(S11=Datos!$B$87,20,IF(S11=Datos!$B$88,25,0)))))))/100)+((IF(T11=Datos!$B$83,0,IF(T11=Datos!$B$84,5,IF(T11=Datos!$B$85,10,IF(T11=Datos!$B$86,15,IF(T11=Datos!$B$87,20,IF(T11=Datos!$B$88,25,0)))))))/100)","v":0.8},{"$f":"IF(ISERROR((IF(P11=Datos!$B$80,SGC!U11,0)+IF(P12=Datos!$B$80,SGC!U12,0)+IF(P13=Datos!$B$80,SGC!U13,0)+IF(P14=Datos!$B$80,SGC!U14,0)+IF(P15=Datos!$B$80,SGC!U15,0)+IF(P16=Datos!$B$80,SGC!U16,0))/(IF(P11=Datos!$B$80,1,0)+IF(P12=Datos!$B$80,1,0)+IF(P13=Datos!$B$80,1,0)+IF(P14=Datos!$B$80,1,0)+IF(P15=Datos!$B$80,1,0)+IF(P16=Datos!$B$80,1,0))),0,(IF(P11=Datos!$B$80,SGC!U11,0)+IF(P12=Datos!$B$80,SGC!U12,0)+IF(P13=Datos!$B$80,SGC!U13,0)+IF(P14=Datos!$B$80,SGC!U14,0)+IF(P15=Datos!$B$80,SGC!U15,0)+IF(P16=Datos!$B$80,SGC!U16,0))/(IF(P11=Datos!$B$80,1,0)+IF(P12=Datos!$B$80,1,0)+IF(P13=Datos!$B$80,1,0)+IF(P14=Datos!$B$80,1,0)+IF(P15=Datos!$B$80,1,0)+IF(P16=Datos!$B$80,1,0)))","v":0.76666666666666661},{"$f":"IF(L11=\"\",\"-\",(IF(V11>0,(IF(L11=Datos!$B$65,Datos!$B$65,IF(AND(L11=Datos!$B$66,V11>0.49),Datos!$B$65,IF(AND(L11=Datos!$B$67,V11>0.74),Datos!$B$65,IF(AND(L11=Datos!$B$67,V11<0.75,V11>0.49),Datos!$B$66,IF(AND(L11=Datos!$B$68,V11>0.74),Datos!$B$66,IF(AND(L11=Datos!$B$68,V11<0.75,V11>0.49),Datos!$B$67,IF(AND(L11=Datos!$B$69,V11>0.74),Datos!$B$67,IF(AND(L11=Datos!$B$69,V11<0.75,V11>0.49),Datos!$B$68,L11))))))))),L11)))","v":"Raro - 1"},{"$f":"IF(ISERROR((IF(P11=Datos!$B$79,SGC!U11,0)+IF(P12=Datos!$B$79,SGC!U12,0)+IF(P13=Datos!$B$79,SGC!U13,0)+IF(P14=Datos!$B$79,SGC!U14,0)+IF(P15=Datos!$B$79,SGC!U15,0)+IF(P16=Datos!$B$79,SGC!U16,0))/(IF(P11=Datos!$B$79,1,0)+IF(P12=Datos!$B$79,1,0)+IF(P13=Datos!$B$79,1,0)+IF(P14=Datos!$B$79,1,0)+IF(P15=Datos!$B$79,1,0)+IF(P16=Datos!$B$79,1,0))),0,(IF(P11=Datos!$B$79,SGC!U11,0)+IF(P12=Datos!$B$79,SGC!U12,0)+IF(P13=Datos!$B$79,SGC!U13,0)+IF(P14=Datos!$B$79,SGC!U14,0)+IF(P15=Datos!$B$79,SGC!U15,0)+IF(P16=Datos!$B$79,SGC!U16,0))/(IF(P11=Datos!$B$79,1,0)+IF(P12=Datos!$B$79,1,0)+IF(P13=Datos!$B$79,1,0)+IF(P14=Datos!$B$79,1,0)+IF(P15=Datos!$B$79,1,0)+IF(P16=Datos!$B$79,1,0)))","v":0.8},{"$f":"IF(M11=\"\",\"-\",(IF(X11>0,(IF(M11=Datos!$B$72,Datos!$B$72,IF(AND(M11=Datos!$B$73,X11>0.49),Datos!$B$72,IF(AND(M11=Datos!$B$74,X11>0.74),Datos!$B$72,IF(AND(M11=Datos!$B$74,X11<0.75,X11>0.49),Datos!$B$73,IF(AND(M11=Datos!$B$75,X11>0.74),Datos!$B$73,IF(AND(M11=Datos!$B$75,X11<0.75,X11>0.49),Datos!$B$74,IF(AND(M11=Datos!$B$76,X11>0.74),Datos!$B$74,IF(AND(M11=Datos!$B$76,X11<0.75,X11>0.49),Datos!$B$75,M11))))))))),M11)))","v":"Menor - 2"},{"$f":"IF(AND(W11=Datos!$B$65,Y11=Datos!$B$72),Datos!$D$65,IF(AND(W11=Datos!$B$65,Y11=Datos!$B$73),Datos!$E$65,IF(AND(W11=Datos!$B$65,Y11=Datos!$B$74),Datos!$F$65,IF(AND(W11=Datos!$B$65,Y11=Datos!$B$75),Datos!$G$65,IF(AND(W11=Datos!$B$65,Y11=Datos!$B$76),Datos!$H$65,IF(AND(W11=Datos!$B$66,Y11=Datos!$B$72),Datos!$D$66,IF(AND(W11=Datos!$B$66,Y11=Datos!$B$73),Datos!$E$66,IF(AND(W11=Datos!$B$66,Y11=Datos!$B$74),Datos!$F$66,IF(AND(W11=Datos!$B$66,Y11=Datos!$B$75),Datos!$G$66,IF(AND(W11=Datos!$B$66,Y11=Datos!$B$76),Datos!$H$66,IF(AND(W11=Datos!$B$67,Y11=Datos!$B$72),Datos!$D$67,IF(AND(W11=Datos!$B$67,Y11=Datos!$B$73),Datos!$E$67,IF(AND(W11=Datos!$B$67,Y11=Datos!$B$74),Datos!$F$67,IF(AND(W11=Datos!$B$67,Y11=Datos!$B$75),Datos!$G$67,IF(AND(W11=Datos!$B$67,Y11=Datos!$B$76),Datos!$H$67,IF(AND(W11=Datos!$B$68,Y11=Datos!$B$72),Datos!$D$68,IF(AND(W11=Datos!$B$68,Y11=Datos!$B$73),Datos!$E$68,IF(AND(W11=Datos!$B$68,Y11=Datos!$B$74),Datos!$F$68,IF(AND(W11=Datos!$B$68,Y11=Datos!$B$75),Datos!$G$68,IF(AND(W11=Datos!$B$68,Y11=Datos!$B$76),Datos!$H$68,IF(AND(W11=Datos!$B$69,Y11=Datos!$B$72),Datos!$D$69,IF(AND(W11=Datos!$B$69,Y11=Datos!$B$73),Datos!$E$69,IF(AND(W11=Datos!$B$69,Y11=Datos!$B$74),Datos!$F$69,IF(AND(W11=Datos!$B$69,Y11=Datos!$B$75),Datos!$G$69,IF(AND(W11=Datos!$B$69,Y11=Datos!$B$76),Datos!$H$69,\"-\")))))))))))))))))))))))))","v":"BAJO - ACEPTABLE 2"},"Reducir (RE)"]
[null,null,null,null,"Divulgación  del check list para las licitaciones",null,"Interno",null,null,null,"Pérdida de Beneficio",null,null,null,"Ajuste al formato propuesta EPS-PR-001-FR-001","Preventivo ","Alto - 25","Alto - 25","Medio - 15","Alto - 25",{"$f":"((IF(Q12=Datos!$B$83,0,IF(Q12=Datos!$B$84,5,IF(Q12=Datos!$B$85,10,IF(Q12=Datos!$B$86,15,IF(Q12=Datos!$B$87,20,IF(Q12=Datos!$B$88,25,0)))))))/100)+((IF(R12=Datos!$B$83,0,IF(R12=Datos!$B$84,5,IF(R12=Datos!$B$85,10,IF(R12=Datos!$B$86,15,IF(R12=Datos!$B$87,20,IF(R12=Datos!$B$88,25,0)))))))/100)+((IF(S12=Datos!$B$83,0,IF(S12=Datos!$B$84,5,IF(S12=Datos!$B$85,10,IF(S12=Datos!$B$86,15,IF(S12=Datos!$B$87,20,IF(S12=Datos!$B$88,25,0)))))))/100)+((IF(T12=Datos!$B$83,0,IF(T12=Datos!$B$84,5,IF(T12=Datos!$B$85,10,IF(T12=Datos!$B$86,15,IF(T12=Datos!$B$87,20,IF(T12=Datos!$B$88,25,0)))))))/100)","v":0.9}]
[null,null,null,null,"Falta de Insumos (papelería y suministros)",null,"Interno",null,null,null,"Pérdida de Imagen de la universidad",null,null,null,"Divulgación en la página institucional SIEXUD","Preventivo ","Alto - 25","Alto - 25","Medio - 10","Medio - 10",{"$f":"((IF(Q13=Datos!$B$83,0,IF(Q13=Datos!$B$84,5,IF(Q13=Datos!$B$85,10,IF(Q13=Datos!$B$86,15,IF(Q13=Datos!$B$87,20,IF(Q13=Datos!$B$88,25,0)))))))/100)+((IF(R13=Datos!$B$83,0,IF(R13=Datos!$B$84,5,IF(R13=Datos!$B$85,10,IF(R13=Datos!$B$86,15,IF(R13=Datos!$B$87,20,IF(R13=Datos!$B$88,25,0)))))))/100)+((IF(S13=Datos!$B$83,0,IF(S13=Datos!$B$84,5,IF(S13=Datos!$B$85,10,IF(S13=Datos!$B$86,15,IF(S13=Datos!$B$87,20,IF(S13=Datos!$B$88,25,0)))))))/100)+((IF(T13=Datos!$B$83,0,IF(T13=Datos!$B$84,5,IF(T13=Datos!$B$85,10,IF(T13=Datos!$B$86,15,IF(T13=Datos!$B$87,20,IF(T13=Datos!$B$88,25,0)))))))/100)","v":0.7}]
[null,null,null,null,null,null,null,null,null,null,null,null,null,null,"socialización personal responsable de en el área de Gestión de Licitación e Invitación directa","Preventivo ","Alto - 25","Alto - 25","Medio - 10","Medio - 10",{"$f":"((IF(Q14=Datos!$B$83,0,IF(Q14=Datos!$B$84,5,IF(Q14=Datos!$B$85,10,IF(Q14=Datos!$B$86,15,IF(Q14=Datos!$B$87,20,IF(Q14=Datos!$B$88,25,0)))))))/100)+((IF(R14=Datos!$B$83,0,IF(R14=Datos!$B$84,5,IF(R14=Datos!$B$85,10,IF(R14=Datos!$B$86,15,IF(R14=Datos!$B$87,20,IF(R14=Datos!$B$88,25,0)))))))/100)+((IF(S14=Datos!$B$83,0,IF(S14=Datos!$B$84,5,IF(S14=Datos!$B$85,10,IF(S14=Datos!$B$86,15,IF(S14=Datos!$B$87,20,IF(S14=Datos!$B$88,25,0)))))))/100)+((IF(T14=Datos!$B$83,0,IF(T14=Datos!$B$84,5,IF(T14=Datos!$B$85,10,IF(T14=Datos!$B$86,15,IF(T14=Datos!$B$87,20,IF(T14=Datos!$B$88,25,0)))))))/100)","v":0.7}]
[null,null,null,null,null,null,null,null,null,null,null,null,null,null,null,null,null,null,null,null,{"$f":"((IF(Q15=Datos!$B$83,0,IF(Q15=Datos!$B$84,5,IF(Q15=Datos!$B$85,10,IF(Q15=Datos!$B$86,15,IF(Q15=Datos!$B$87,20,IF(Q15=Datos!$B$88,25,0)))))))/100)+((IF(R15=Datos!$B$83,0,IF(R15=Datos!$B$84,5,IF(R15=Datos!$B$85,10,IF(R15=Datos!$B$86,15,IF(R15=Datos!$B$87,20,IF(R15=Datos!$B$88,25,0)))))))/100)+((IF(S15=Datos!$B$83,0,IF(S15=Datos!$B$84,5,IF(S15=Datos!$B$85,10,IF(S15=Datos!$B$86,15,IF(S15=Datos!$B$87,20,IF(S15=Datos!$B$88,25,0)))))))/100)+((IF(T15=Datos!$B$83,0,IF(T15=Datos!$B$84,5,IF(T15=Datos!$B$85,10,IF(T15=Datos!$B$86,15,IF(T15=Datos!$B$87,20,IF(T15=Datos!$B$88,25,0)))))))/100)","v":0}]
[null,null,null,null,null,null,null,null,null,null,null,null,null,null,null,null,null,null,null,null,{"$f":"((IF(Q16=Datos!$B$83,0,IF(Q16=Datos!$B$84,5,IF(Q16=Datos!$B$85,10,IF(Q16=Datos!$B$86,15,IF(Q16=Datos!$B$87,20,IF(Q16=Datos!$B$88,25,0)))))))/100)+((IF(R16=Datos!$B$83,0,IF(R16=Datos!$B$84,5,IF(R16=Datos!$B$85,10,IF(R16=Datos!$B$86,15,IF(R16=Datos!$B$87,20,IF(R16=Datos!$B$88,25,0)))))))/100)+((IF(S16=Datos!$B$83,0,IF(S16=Datos!$B$84,5,IF(S16=Datos!$B$85,10,IF(S16=Datos!$B$86,15,IF(S16=Datos!$B$87,20,IF(S16=Datos!$B$88,25,0)))))))/100)+((IF(T16=Datos!$B$83,0,IF(T16=Datos!$B$84,5,IF(T16=Datos!$B$85,10,IF(T16=Datos!$B$86,15,IF(T16=Datos!$B$87,20,IF(T16=Datos!$B$88,25,0)))))))/100)","v":0}]
[null,"Extensión y Proyección Social",null,{"$f":"IF(B17=\"\",\"-\",VLOOKUP(B17,Datos!$B$4:$C$25,2,FALSE))","v":"Promover la Vinculación de la Universidad Distrital Francisco José de Caldas con su Entorno social, a través de la coordinación de los programas, planes y proyectos de Extensión y Proyección Social, en articulación a la Docencia y la Investigación."},"falta de acompañamiento por el personal delegado   de la oficina asesora de planeación y control y aprobación final de de la informacion presentada por el IDEXUD ",null,"Interno","Falta de Identificación formalización e implementación de los procesos y procedimientos ","Se refiere al manejo incompleto e inadecuado de la información producto de las diferentes actividades  de extensión y proyección social ","Operativos","Reprocesamiento de actividades Administrativas por falta de conocimiento en los procedimientos","Probable - 4","Moderado - 3",{"$f":"IF(AND(L17=Datos!$B$65,M17=Datos!$B$72),Datos!$D$65,IF(AND(L17=Datos!$B$65,M17=Datos!$B$73),Datos!$E$65,IF(AND(L17=Datos!$B$65,M17=Datos!$B$74),Datos!$F$65,IF(AND(L17=Datos!$B$65,M17=Datos!$B$75),Datos!$G$65,IF(AND(L17=Datos!$B$65,M17=Datos!$B$76),Datos!$H$65,IF(AND(L17=Datos!$B$66,M17=Datos!$B$72),Datos!$D$66,IF(AND(L17=Datos!$B$66,M17=Datos!$B$73),Datos!$E$66,IF(AND(L17=Datos!$B$66,M17=Datos!$B$74),Datos!$F$66,IF(AND(L17=Datos!$B$66,M17=Datos!$B$75),Datos!$G$66,IF(AND(L17=Datos!$B$66,M17=Datos!$B$76),Datos!$H$66,IF(AND(L17=Datos!$B$67,M17=Datos!$B$72),Datos!$D$67,IF(AND(L17=Datos!$B$67,M17=Datos!$B$73),Datos!$E$67,IF(AND(L17=Datos!$B$67,M17=Datos!$B$74),Datos!$F$67,IF(AND(L17=Datos!$B$67,M17=Datos!$B$75),Datos!$G$67,IF(AND(L17=Datos!$B$67,M17=Datos!$B$76),Datos!$H$67,IF(AND(L17=Datos!$B$68,M17=Datos!$B$72),Datos!$D$68,IF(AND(L17=Datos!$B$68,M17=Datos!$B$73),Datos!$E$68,IF(AND(L17=Datos!$B$68,M17=Datos!$B$74),Datos!$F$68,IF(AND(L17=Datos!$B$68,M17=Datos!$B$75),Datos!$G$68,IF(AND(L17=Datos!$B$68,M17=Datos!$B$76),Datos!$H$68,IF(AND(L17=Datos!$B$69,M17=Datos!$B$72),Datos!$D$69,IF(AND(L17=Datos!$B$69,M17=Datos!$B$73),Datos!$E$69,IF(AND(L17=Datos!$B$69,M17=Datos!$B$74),Datos!$F$69,IF(AND(L17=Datos!$B$69,M17=Datos!$B$75),Datos!$G$69,IF(AND(L17=Datos!$B$69,M17=Datos!$B$76),Datos!$H$69,\"-\")))))))))))))))))))))))))","v":"ALTA - IMPORTANTE 12"},"Elaboración de los siguientes procedimientos : (EPS-PR-001; EPS-PR-002; EPS-PR-003; EPS-PR-004; EPS-PR-005; EPS-PR-006; EPS-PR-007; EPS-PR-008; EPS-PR-009; EPS-PR-010)\n","Correctivo","Alto - 25","Alto - 25","Medio Alto - 20","Medio - 15",{"$f":"((IF(Q17=Datos!$B$83,0,IF(Q17=Datos!$B$84,5,IF(Q17=Datos!$B$85,10,IF(Q17=Datos!$B$86,15,IF(Q17=Datos!$B$87,20,IF(Q17=Datos!$B$88,25,0)))))))/100)+((IF(R17=Datos!$B$83,0,IF(R17=Datos!$B$84,5,IF(R17=Datos!$B$85,10,IF(R17=Datos!$B$86,15,IF(R17=Datos!$B$87,20,IF(R17=Datos!$B$88,25,0)))))))/100)+((IF(S17=Datos!$B$83,0,IF(S17=Datos!$B$84,5,IF(S17=Datos!$B$85,10,IF(S17=Datos!$B$86,15,IF(S17=Datos!$B$87,20,IF(S17=Datos!$B$88,25,0)))))))/100)+((IF(T17=Datos!$B$83,0,IF(T17=Datos!$B$84,5,IF(T17=Datos!$B$85,10,IF(T17=Datos!$B$86,15,IF(T17=Datos!$B$87,20,IF(T17=Datos!$B$88,25,0)))))))/100)","v":0.85},{"$f":"IF(ISERROR((IF(P17=Datos!$B$80,SGC!U17,0)+IF(P18=Datos!$B$80,SGC!U18,0)+IF(P19=Datos!$B$80,SGC!U19,0)+IF(P20=Datos!$B$80,SGC!U20,0)+IF(P21=Datos!$B$80,SGC!U21,0)+IF(P22=Datos!$B$80,SGC!U22,0))/(IF(P17=Datos!$B$80,1,0)+IF(P18=Datos!$B$80,1,0)+IF(P19=Datos!$B$80,1,0)+IF(P20=Datos!$B$80,1,0)+IF(P21=Datos!$B$80,1,0)+IF(P22=Datos!$B$80,1,0))),0,(IF(P17=Datos!$B$80,SGC!U17,0)+IF(P18=Datos!$B$80,SGC!U18,0)+IF(P19=Datos!$B$80,SGC!U19,0)+IF(P20=Datos!$B$80,SGC!U20,0)+IF(P21=Datos!$B$80,SGC!U21,0)+IF(P22=Datos!$B$80,SGC!U22,0))/(IF(P17=Datos!$B$80,1,0)+IF(P18=Datos!$B$80,1,0)+IF(P19=Datos!$B$80,1,0)+IF(P20=Datos!$B$80,1,0)+IF(P21=Datos!$B$80,1,0)+IF(P22=Datos!$B$80,1,0)))","v":0.8},{"$f":"IF(L17=\"\",\"-\",(IF(V17>0,(IF(L17=Datos!$B$65,Datos!$B$65,IF(AND(L17=Datos!$B$66,V17>0.49),Datos!$B$65,IF(AND(L17=Datos!$B$67,V17>0.74),Datos!$B$65,IF(AND(L17=Datos!$B$67,V17<0.75,V17>0.49),Datos!$B$66,IF(AND(L17=Datos!$B$68,V17>0.74),Datos!$B$66,IF(AND(L17=Datos!$B$68,V17<0.75,V17>0.49),Datos!$B$67,IF(AND(L17=Datos!$B$69,V17>0.74),Datos!$B$67,IF(AND(L17=Datos!$B$69,V17<0.75,V17>0.49),Datos!$B$68,L17))))))))),L17)))","v":"Improbable - 2"},{"$f":"IF(ISERROR((IF(P17=Datos!$B$79,SGC!U17,0)+IF(P18=Datos!$B$79,SGC!U18,0)+IF(P19=Datos!$B$79,SGC!U19,0)+IF(P20=Datos!$B$79,SGC!U20,0)+IF(P21=Datos!$B$79,SGC!U21,0)+IF(P22=Datos!$B$79,SGC!U22,0))/(IF(P17=Datos!$B$79,1,0)+IF(P18=Datos!$B$79,1,0)+IF(P19=Datos!$B$79,1,0)+IF(P20=Datos!$B$79,1,0)+IF(P21=Datos!$B$79,1,0)+IF(P22=Datos!$B$79,1,0))),0,(IF(P17=Datos!$B$79,SGC!U17,0)+IF(P18=Datos!$B$79,SGC!U18,0)+IF(P19=Datos!$B$79,SGC!U19,0)+IF(P20=Datos!$B$79,SGC!U20,0)+IF(P21=Datos!$B$79,SGC!U21,0)+IF(P22=Datos!$B$79,SGC!U22,0))/(IF(P17=Datos!$B$79,1,0)+IF(P18=Datos!$B$79,1,0)+IF(P19=Datos!$B$79,1,0)+IF(P20=Datos!$B$79,1,0)+IF(P21=Datos!$B$79,1,0)+IF(P22=Datos!$B$79,1,0)))","v":0.82499999999999996},{"$f":"IF(M17=\"\",\"-\",(IF(X17>0,(IF(M17=Datos!$B$72,Datos!$B$72,IF(AND(M17=Datos!$B$73,X17>0.49),Datos!$B$72,IF(AND(M17=Datos!$B$74,X17>0.74),Datos!$B$72,IF(AND(M17=Datos!$B$74,X17<0.75,X17>0.49),Datos!$B$73,IF(AND(M17=Datos!$B$75,X17>0.74),Datos!$B$73,IF(AND(M17=Datos!$B$75,X17<0.75,X17>0.49),Datos!$B$74,IF(AND(M17=Datos!$B$76,X17>0.74),Datos!$B$74,IF(AND(M17=Datos!$B$76,X17<0.75,X17>0.49),Datos!$B$75,M17))))))))),M17)))","v":"Insignificante - 1"},{"$f":"IF(AND(W17=Datos!$B$65,Y17=Datos!$B$72),Datos!$D$65,IF(AND(W17=Datos!$B$65,Y17=Datos!$B$73),Datos!$E$65,IF(AND(W17=Datos!$B$65,Y17=Datos!$B$74),Datos!$F$65,IF(AND(W17=Datos!$B$65,Y17=Datos!$B$75),Datos!$G$65,IF(AND(W17=Datos!$B$65,Y17=Datos!$B$76),Datos!$H$65,IF(AND(W17=Datos!$B$66,Y17=Datos!$B$72),Datos!$D$66,IF(AND(W17=Datos!$B$66,Y17=Datos!$B$73),Datos!$E$66,IF(AND(W17=Datos!$B$66,Y17=Datos!$B$74),Datos!$F$66,IF(AND(W17=Datos!$B$66,Y17=Datos!$B$75),Datos!$G$66,IF(AND(W17=Datos!$B$66,Y17=Datos!$B$76),Datos!$H$66,IF(AND(W17=Datos!$B$67,Y17=Datos!$B$72),Datos!$D$67,IF(AND(W17=Datos!$B$67,Y17=Datos!$B$73),Datos!$E$67,IF(AND(W17=Datos!$B$67,Y17=Datos!$B$74),Datos!$F$67,IF(AND(W17=Datos!$B$67,Y17=Datos!$B$75),Datos!$G$67,IF(AND(W17=Datos!$B$67,Y17=Datos!$B$76),Datos!$H$67,IF(AND(W17=Datos!$B$68,Y17=Datos!$B$72),Datos!$D$68,IF(AND(W17=Datos!$B$68,Y17=Datos!$B$73),Datos!$E$68,IF(AND(W17=Datos!$B$68,Y17=Datos!$B$74),Datos!$F$68,IF(AND(W17=Datos!$B$68,Y17=Datos!$B$75),Datos!$G$68,IF(AND(W17=Datos!$B$68,Y17=Datos!$B$76),Datos!$H$68,IF(AND(W17=Datos!$B$69,Y17=Datos!$B$72),Datos!$D$69,IF(AND(W17=Datos!$B$69,Y17=Datos!$B$73),Datos!$E$69,IF(AND(W17=Datos!$B$69,Y17=Datos!$B$74),Datos!$F$69,IF(AND(W17=Datos!$B$69,Y17=Datos!$B$75),Datos!$G$69,IF(AND(W17=Datos!$B$69,Y17=Datos!$B$76),Datos!$H$69,\"-\")))))))))))))))))))))))))","v":"BAJO - TRIVIAL 2"},"Reducir (RE)"]
[null,null,null,null,"Falta de jornadas de Socialización a los contratistas del IDEXUD y a las dependencias que que se apoyan en la extensión. ",null,"Interno",null,null,null,"Falta de estandarización de actividades",null,null,null,"Elaboración de los siguientes formatos:\n(EPS-PR-001-FR-001; EPS-PR-001-FR-002; EPS-PR-001-FR-003; EPS-PR-003-FR-004; EPS-PR-003-FR-005; EPS-PR-003-FR-006\nEPS-PR-003-FR-007; EPS-PR-003-FR-008; EPS-PR-004-FR-009; EPS-PR-006-FR-010; EPS-PR-006-FR-011; EPS-PR-007-FR-012; EPS-PR-007-FR-013; EPS-PR-008-FR-014; EPS-PR-009-015)\n","Correctivo","Alto - 25","Alto - 25","Medio Alto - 20","Medio - 15",{"$f":"((IF(Q18=Datos!$B$83,0,IF(Q18=Datos!$B$84,5,IF(Q18=Datos!$B$85,10,IF(Q18=Datos!$B$86,15,IF(Q18=Datos!$B$87,20,IF(Q18=Datos!$B$88,25,0)))))))/100)+((IF(R18=Datos!$B$83,0,IF(R18=Datos!$B$84,5,IF(R18=Datos!$B$85,10,IF(R18=Datos!$B$86,15,IF(R18=Datos!$B$87,20,IF(R18=Datos!$B$88,25,0)))))))/100)+((IF(S18=Datos!$B$83,0,IF(S18=Datos!$B$84,5,IF(S18=Datos!$B$85,10,IF(S18=Datos!$B$86,15,IF(S18=Datos!$B$87,20,IF(S18=Datos!$B$88,25,0)))))))/100)+((IF(T18=Datos!$B$83,0,IF(T18=Datos!$B$84,5,IF(T18=Datos!$B$85,10,IF(T18=Datos!$B$86,15,IF(T18=Datos!$B$87,20,IF(T18=Datos!$B$88,25,0)))))))/100)","v":0.85}]
[null,null,null,null,null,null,null,null,null,null,"Poca evidencia por falta de formatos y registros",null,null,null,"Publicación en la página Web del IDEXUD con el fin de socializar la información","Preventivo ","Alto - 25","Medio Alto - 20","Medio Alto - 20","Medio - 15",{"$f":"((IF(Q19=Datos!$B$83,0,IF(Q19=Datos!$B$84,5,IF(Q19=Datos!$B$85,10,IF(Q19=Datos!$B$86,15,IF(Q19=Datos!$B$87,20,IF(Q19=Datos!$B$88,25,0)))))))/100)+((IF(R19=Datos!$B$83,0,IF(R19=Datos!$B$84,5,IF(R19=Datos!$B$85,10,IF(R19=Datos!$B$86,15,IF(R19=Datos!$B$87,20,IF(R19=Datos!$B$88,25,0)))))))/100)+((IF(S19=Datos!$B$83,0,IF(S19=Datos!$B$84,5,IF(S19=Datos!$B$85,10,IF(S19=Datos!$B$86,15,IF(S19=Datos!$B$87,20,IF(S19=Datos!$B$88,25,0)))))))/100)+((IF(T19=Datos!$B$83,0,IF(T19=Datos!$B$84,5,IF(T19=Datos!$B$85,10,IF(T19=Datos!$B$86,15,IF(T19=Datos!$B$87,20,IF(T19=Datos!$B$88,25,0)))))))/100)","v":0.8}]
[null,null,null,null,null,null,null,null,null,null,"uso inadecuado de los tiempos y diversos formatos para dar respuesta a una sola tarea.",null,null,null,"jornadas de socialización grupal y personal a lo contratistas del IDEXUD","Correctivo","Alto - 25","Medio Alto - 20","Medio Alto - 20","Medio - 15",{"$f":"((IF(Q20=Datos!$B$83,0,IF(Q20=Datos!$B$84,5,IF(Q20=Datos!$B$85,10,IF(Q20=Datos!$B$86,15,IF(Q20=Datos!$B$87,20,IF(Q20=Datos!$B$88,25,0)))))))/100)+((IF(R20=Datos!$B$83,0,IF(R20=Datos!$B$84,5,IF(R20=Datos!$B$85,10,IF(R20=Datos!$B$86,15,IF(R20=Datos!$B$87,20,IF(R20=Datos!$B$88,25,0)))))))/100)+((IF(S20=Datos!$B$83,0,IF(S20=Datos!$B$84,5,IF(S20=Datos!$B$85,10,IF(S20=Datos!$B$86,15,IF(S20=Datos!$B$87,20,IF(S20=Datos!$B$88,25,0)))))))/100)+((IF(T20=Datos!$B$83,0,IF(T20=Datos!$B$84,5,IF(T20=Datos!$B$85,10,IF(T20=Datos!$B$86,15,IF(T20=Datos!$B$87,20,IF(T20=Datos!$B$88,25,0)))))))/100)","v":0.8}]
[null,null,null,null,null,null,null,null,null,null,null,null,null,null,"prueba piloto en el manejo de los formatos, para revisar la trazabilidad de los mismos","Preventivo ","Alto - 25","Medio Alto - 20","Medio Alto - 20","Medio - 15",{"$f":"((IF(Q21=Datos!$B$83,0,IF(Q21=Datos!$B$84,5,IF(Q21=Datos!$B$85,10,IF(Q21=Datos!$B$86,15,IF(Q21=Datos!$B$87,20,IF(Q21=Datos!$B$88,25,0)))))))/100)+((IF(R21=Datos!$B$83,0,IF(R21=Datos!$B$84,5,IF(R21=Datos!$B$85,10,IF(R21=Datos!$B$86,15,IF(R21=Datos!$B$87,20,IF(R21=Datos!$B$88,25,0)))))))/100)+((IF(S21=Datos!$B$83,0,IF(S21=Datos!$B$84,5,IF(S21=Datos!$B$85,10,IF(S21=Datos!$B$86,15,IF(S21=Datos!$B$87,20,IF(S21=Datos!$B$88,25,0)))))))/100)+((IF(T21=Datos!$B$83,0,IF(T21=Datos!$B$84,5,IF(T21=Datos!$B$85,10,IF(T21=Datos!$B$86,15,IF(T21=Datos!$B$87,20,IF(T21=Datos!$B$88,25,0)))))))/100)","v":0.8}]
[null,null,null,null,null,null,null,null,null,null,null,null,null,null,"Emisión de Circular por parte de la dirección para el uso oficial ","Correctivo","Alto - 25","Medio Alto - 20","Medio Alto - 20","Medio - 15",{"$f":"((IF(Q22=Datos!$B$83,0,IF(Q22=Datos!$B$84,5,IF(Q22=Datos!$B$85,10,IF(Q22=Datos!$B$86,15,IF(Q22=Datos!$B$87,20,IF(Q22=Datos!$B$88,25,0)))))))/100)+((IF(R22=Datos!$B$83,0,IF(R22=Datos!$B$84,5,IF(R22=Datos!$B$85,10,IF(R22=Datos!$B$86,15,IF(R22=Datos!$B$87,20,IF(R22=Datos!$B$88,25,0)))))))/100)+((IF(S22=Datos!$B$83,0,IF(S22=Datos!$B$84,5,IF(S22=Datos!$B$85,10,IF(S22=Datos!$B$86,15,IF(S22=Datos!$B$87,20,IF(S22=Datos!$B$88,25,0)))))))/100)+((IF(T22=Datos!$B$83,0,IF(T22=Datos!$B$84,5,IF(T22=Datos!$B$85,10,IF(T22=Datos!$B$86,15,IF(T22=Datos!$B$87,20,IF(T22=Datos!$B$88,25,0)))))))/100)","v":0.8}]
[null,"Extensión y Proyección Social",null,{"$f":"IF(B23=\"\",\"-\",VLOOKUP(B23,Datos!$B$4:$C$25,2,FALSE))","v":"Promover la Vinculación de la Universidad Distrital Francisco José de Caldas con su Entorno social, a través de la coordinación de los programas, planes y proyectos de Extensión y Proyección Social, en articulación a la Docencia y la Investigación."},"mala planeación en las estrategias de divulgación",null,"Interno","Bajo reconocimiento  de las funciones realizadas por el instituto de extensión y proyección social","Hace referencia al poco reconocimiento del impacto  que tienen las actividades realizadas por la unidad de Extensión","Operativos","Perdida de imagen del instituto","Posible - 3","Moderado - 3",{"$f":"IF(AND(L23=Datos!$B$65,M23=Datos!$B$72),Datos!$D$65,IF(AND(L23=Datos!$B$65,M23=Datos!$B$73),Datos!$E$65,IF(AND(L23=Datos!$B$65,M23=Datos!$B$74),Datos!$F$65,IF(AND(L23=Datos!$B$65,M23=Datos!$B$75),Datos!$G$65,IF(AND(L23=Datos!$B$65,M23=Datos!$B$76),Datos!$H$65,IF(AND(L23=Datos!$B$66,M23=Datos!$B$72),Datos!$D$66,IF(AND(L23=Datos!$B$66,M23=Datos!$B$73),Datos!$E$66,IF(AND(L23=Datos!$B$66,M23=Datos!$B$74),Datos!$F$66,IF(AND(L23=Datos!$B$66,M23=Datos!$B$75),Datos!$G$66,IF(AND(L23=Datos!$B$66,M23=Datos!$B$76),Datos!$H$66,IF(AND(L23=Datos!$B$67,M23=Datos!$B$72),Datos!$D$67,IF(AND(L23=Datos!$B$67,M23=Datos!$B$73),Datos!$E$67,IF(AND(L23=Datos!$B$67,M23=Datos!$B$74),Datos!$F$67,IF(AND(L23=Datos!$B$67,M23=Datos!$B$75),Datos!$G$67,IF(AND(L23=Datos!$B$67,M23=Datos!$B$76),Datos!$H$67,IF(AND(L23=Datos!$B$68,M23=Datos!$B$72),Datos!$D$68,IF(AND(L23=Datos!$B$68,M23=Datos!$B$73),Datos!$E$68,IF(AND(L23=Datos!$B$68,M23=Datos!$B$74),Datos!$F$68,IF(AND(L23=Datos!$B$68,M23=Datos!$B$75),Datos!$G$68,IF(AND(L23=Datos!$B$68,M23=Datos!$B$76),Datos!$H$68,IF(AND(L23=Datos!$B$69,M23=Datos!$B$72),Datos!$D$69,IF(AND(L23=Datos!$B$69,M23=Datos!$B$73),Datos!$E$69,IF(AND(L23=Datos!$B$69,M23=Datos!$B$74),Datos!$F$69,IF(AND(L23=Datos!$B$69,M23=Datos!$B$75),Datos!$G$69,IF(AND(L23=Datos!$B$69,M23=Datos!$B$76),Datos!$H$69,\"-\")))))))))))))))))))))))))","v":"ALTA - IMPORTANTE 9"},"actualización pagina siexud con el portafolio de el Instituto y Direccionamiento estratégico claro, además de la estructura Organizacional de la Extensión. Actualización estadísticas generales frente a proyectos y su modalidad","Correctivo","Alto - 25","Alto - 25","Alto - 25","Medio - 15",{"$f":"((IF(Q23=Datos!$B$83,0,IF(Q23=Datos!$B$84,5,IF(Q23=Datos!$B$85,10,IF(Q23=Datos!$B$86,15,IF(Q23=Datos!$B$87,20,IF(Q23=Datos!$B$88,25,0)))))))/100)+((IF(R23=Datos!$B$83,0,IF(R23=Datos!$B$84,5,IF(R23=Datos!$B$85,10,IF(R23=Datos!$B$86,15,IF(R23=Datos!$B$87,20,IF(R23=Datos!$B$88,25,0)))))))/100)+((IF(S23=Datos!$B$83,0,IF(S23=Datos!$B$84,5,IF(S23=Datos!$B$85,10,IF(S23=Datos!$B$86,15,IF(S23=Datos!$B$87,20,IF(S23=Datos!$B$88,25,0)))))))/100)+((IF(T23=Datos!$B$83,0,IF(T23=Datos!$B$84,5,IF(T23=Datos!$B$85,10,IF(T23=Datos!$B$86,15,IF(T23=Datos!$B$87,20,IF(T23=Datos!$B$88,25,0)))))))/100)","v":0.9},{"$f":"IF(ISERROR((IF(P23=Datos!$B$80,SGC!U23,0)+IF(P24=Datos!$B$80,SGC!U24,0)+IF(P25=Datos!$B$80,SGC!U25,0)+IF(P26=Datos!$B$80,SGC!U26,0)+IF(P27=Datos!$B$80,SGC!U27,0)+IF(P28=Datos!$B$80,SGC!U28,0))/(IF(P23=Datos!$B$80,1,0)+IF(P24=Datos!$B$80,1,0)+IF(P25=Datos!$B$80,1,0)+IF(P26=Datos!$B$80,1,0)+IF(P27=Datos!$B$80,1,0)+IF(P28=Datos!$B$80,1,0))),0,(IF(P23=Datos!$B$80,SGC!U23,0)+IF(P24=Datos!$B$80,SGC!U24,0)+IF(P25=Datos!$B$80,SGC!U25,0)+IF(P26=Datos!$B$80,SGC!U26,0)+IF(P27=Datos!$B$80,SGC!U27,0)+IF(P28=Datos!$B$80,SGC!U28,0))/(IF(P23=Datos!$B$80,1,0)+IF(P24=Datos!$B$80,1,0)+IF(P25=Datos!$B$80,1,0)+IF(P26=Datos!$B$80,1,0)+IF(P27=Datos!$B$80,1,0)+IF(P28=Datos!$B$80,1,0)))","v":0},{"$f":"IF(L23=\"\",\"-\",(IF(V23>0,(IF(L23=Datos!$B$65,Datos!$B$65,IF(AND(L23=Datos!$B$66,V23>0.49),Datos!$B$65,IF(AND(L23=Datos!$B$67,V23>0.74),Datos!$B$65,IF(AND(L23=Datos!$B$67,V23<0.75,V23>0.49),Datos!$B$66,IF(AND(L23=Datos!$B$68,V23>0.74),Datos!$B$66,IF(AND(L23=Datos!$B$68,V23<0.75,V23>0.49),Datos!$B$67,IF(AND(L23=Datos!$B$69,V23>0.74),Datos!$B$67,IF(AND(L23=Datos!$B$69,V23<0.75,V23>0.49),Datos!$B$68,L23))))))))),L23)))","v":"Posible - 3"},{"$f":"IF(ISERROR((IF(P23=Datos!$B$79,SGC!U23,0)+IF(P24=Datos!$B$79,SGC!U24,0)+IF(P25=Datos!$B$79,SGC!U25,0)+IF(P26=Datos!$B$79,SGC!U26,0)+IF(P27=Datos!$B$79,SGC!U27,0)+IF(P28=Datos!$B$79,SGC!U28,0))/(IF(P23=Datos!$B$79,1,0)+IF(P24=Datos!$B$79,1,0)+IF(P25=Datos!$B$79,1,0)+IF(P26=Datos!$B$79,1,0)+IF(P27=Datos!$B$79,1,0)+IF(P28=Datos!$B$79,1,0))),0,(IF(P23=Datos!$B$79,SGC!U23,0)+IF(P24=Datos!$B$79,SGC!U24,0)+IF(P25=Datos!$B$79,SGC!U25,0)+IF(P26=Datos!$B$79,SGC!U26,0)+IF(P27=Datos!$B$79,SGC!U27,0)+IF(P28=Datos!$B$79,SGC!U28,0))/(IF(P23=Datos!$B$79,1,0)+IF(P24=Datos!$B$79,1,0)+IF(P25=Datos!$B$79,1,0)+IF(P26=Datos!$B$79,1,0)+IF(P27=Datos!$B$79,1,0)+IF(P28=Datos!$B$79,1,0)))","v":0.9},{"$f":"IF(M23=\"\",\"-\",(IF(X23>0,(IF(M23=Datos!$B$72,Datos!$B$72,IF(AND(M23=Datos!$B$73,X23>0.49),Datos!$B$72,IF(AND(M23=Datos!$B$74,X23>0.74),Datos!$B$72,IF(AND(M23=Datos!$B$74,X23<0.75,X23>0.49),Datos!$B$73,IF(AND(M23=Datos!$B$75,X23>0.74),Datos!$B$73,IF(AND(M23=Datos!$B$75,X23<0.75,X23>0.49),Datos!$B$74,IF(AND(M23=Datos!$B$76,X23>0.74),Datos!$B$74,IF(AND(M23=Datos!$B$76,X23<0.75,X23>0.49),Datos!$B$75,M23))))))))),M23)))","v":"Insignificante - 1"},{"$f":"IF(AND(W23=Datos!$B$65,Y23=Datos!$B$72),Datos!$D$65,IF(AND(W23=Datos!$B$65,Y23=Datos!$B$73),Datos!$E$65,IF(AND(W23=Datos!$B$65,Y23=Datos!$B$74),Datos!$F$65,IF(AND(W23=Datos!$B$65,Y23=Datos!$B$75),Datos!$G$65,IF(AND(W23=Datos!$B$65,Y23=Datos!$B$76),Datos!$H$65,IF(AND(W23=Datos!$B$66,Y23=Datos!$B$72),Datos!$D$66,IF(AND(W23=Datos!$B$66,Y23=Datos!$B$73),Datos!$E$66,IF(AND(W23=Datos!$B$66,Y23=Datos!$B$74),Datos!$F$66,IF(AND(W23=Datos!$B$66,Y23=Datos!$B$75),Datos!$G$66,IF(AND(W23=Datos!$B$66,Y23=Datos!$B$76),Datos!$H$66,IF(AND(W23=Datos!$B$67,Y23=Datos!$B$72),Datos!$D$67,IF(AND(W23=Datos!$B$67,Y23=Datos!$B$73),Datos!$E$67,IF(AND(W23=Datos!$B$67,Y23=Datos!$B$74),Datos!$F$67,IF(AND(W23=Datos!$B$67,Y23=Datos!$B$75),Datos!$G$67,IF(AND(W23=Datos!$B$67,Y23=Datos!$B$76),Datos!$H$67,IF(AND(W23=Datos!$B$68,Y23=Datos!$B$72),Datos!$D$68,IF(AND(W23=Datos!$B$68,Y23=Datos!$B$73),Datos!$E$68,IF(AND(W23=Datos!$B$68,Y23=Datos!$B$74),Datos!$F$68,IF(AND(W23=Datos!$B$68,Y23=Datos!$B$75),Datos!$G$68,IF(AND(W23=Datos!$B$68,Y23=Datos!$B$76),Datos!$H$68,IF(AND(W23=Datos!$B$69,Y23=Datos!$B$72),Datos!$D$69,IF(AND(W23=Datos!$B$69,Y23=Datos!$B$73),Datos!$E$69,IF(AND(W23=Datos!$B$69,Y23=Datos!$B$74),Datos!$F$69,IF(AND(W23=Datos!$B$69,Y23=Datos!$B$75),Datos!$G$69,IF(AND(W23=Datos!$B$69,Y23=Datos!$B$76),Datos!$H$69,\"-\")))))))))))))))))))))))))","v":"BAJO - TRIVIAL 3"},"Reducir (RE)"]
[null,null,null,null,"Inadecuada captura de las necesidades y/o expectativas de los clientes sobre el servicio prestado por el IDEXUD",null,"Interno",null,null,null,"Perdidas económicas",null,null,null,"trabajo continuo en la elaboración de la imagen consolidada de Extensión y la divulgación de la misma en distintos eventos tantos internos( facultades) como en entidades publicas y privadas","Correctivo","Alto - 25","Alto - 25","Alto - 25","Medio - 15",{"$f":"((IF(Q24=Datos!$B$83,0,IF(Q24=Datos!$B$84,5,IF(Q24=Datos!$B$85,10,IF(Q24=Datos!$B$86,15,IF(Q24=Datos!$B$87,20,IF(Q24=Datos!$B$88,25,0)))))))/100)+((IF(R24=Datos!$B$83,0,IF(R24=Datos!$B$84,5,IF(R24=Datos!$B$85,10,IF(R24=Datos!$B$86,15,IF(R24=Datos!$B$87,20,IF(R24=Datos!$B$88,25,0)))))))/100)+((IF(S24=Datos!$B$83,0,IF(S24=Datos!$B$84,5,IF(S24=Datos!$B$85,10,IF(S24=Datos!$B$86,15,IF(S24=Datos!$B$87,20,IF(S24=Datos!$B$88,25,0)))))))/100)+((IF(T24=Datos!$B$83,0,IF(T24=Datos!$B$84,5,IF(T24=Datos!$B$85,10,IF(T24=Datos!$B$86,15,IF(T24=Datos!$B$87,20,IF(T24=Datos!$B$88,25,0)))))))/100)","v":0.9}]
[null,null,null,null,null,null,null,null,null,null,"perdida de invitaciones directas",null,null,null,"diseño y elaboración de Brochure, revista, boletín mensual, video institucional, redes sociales, elaboración de Banner, bolsas corporativas, folletos,para la información sobre el día día de extensión, frente a sus proyectos.","Correctivo","Alto - 25","Alto - 25","Alto - 25","Medio - 15",{"$f":"((IF(Q25=Datos!$B$83,0,IF(Q25=Datos!$B$84,5,IF(Q25=Datos!$B$85,10,IF(Q25=Datos!$B$86,15,IF(Q25=Datos!$B$87,20,IF(Q25=Datos!$B$88,25,0)))))))/100)+((IF(R25=Datos!$B$83,0,IF(R25=Datos!$B$84,5,IF(R25=Datos!$B$85,10,IF(R25=Datos!$B$86,15,IF(R25=Datos!$B$87,20,IF(R25=Datos!$B$88,25,0)))))))/100)+((IF(S25=Datos!$B$83,0,IF(S25=Datos!$B$84,5,IF(S25=Datos!$B$85,10,IF(S25=Datos!$B$86,15,IF(S25=Datos!$B$87,20,IF(S25=Datos!$B$88,25,0)))))))/100)+((IF(T25=Datos!$B$83,0,IF(T25=Datos!$B$84,5,IF(T25=Datos!$B$85,10,IF(T25=Datos!$B$86,15,IF(T25=Datos!$B$87,20,IF(T25=Datos!$B$88,25,0)))))))/100)","v":0.9}]
[null,null,null,null,null,null,null,null,null,null,"poca demanda en la vinculación de estudiantes y egresados",null,null,null,"se implemento el PR- 006-FR-001 MATRIZ DE CONTRATISTAS, para el año 2015, donde se evidencia que los estudiantes tiene una participación significativa en diversos proyectos ejecutados por la extensión, gracias a la labor de la dirección y el área de comunicación, ya que se dirigen a los diversos eventos de la Universidad para dar a conocer las ofertas para su vinculación como pasantes, o para efectos de egresados oferta laboral.","Correctivo","Alto - 25","Alto - 25","Alto - 25","Medio - 15",{"$f":"((IF(Q26=Datos!$B$83,0,IF(Q26=Datos!$B$84,5,IF(Q26=Datos!$B$85,10,IF(Q26=Datos!$B$86,15,IF(Q26=Datos!$B$87,20,IF(Q26=Datos!$B$88,25,0)))))))/100)+((IF(R26=Datos!$B$83,0,IF(R26=Datos!$B$84,5,IF(R26=Datos!$B$85,10,IF(R26=Datos!$B$86,15,IF(R26=Datos!$B$87,20,IF(R26=Datos!$B$88,25,0)))))))/100)+((IF(S26=Datos!$B$83,0,IF(S26=Datos!$B$84,5,IF(S26=Datos!$B$85,10,IF(S26=Datos!$B$86,15,IF(S26=Datos!$B$87,20,IF(S26=Datos!$B$88,25,0)))))))/100)+((IF(T26=Datos!$B$83,0,IF(T26=Datos!$B$84,5,IF(T26=Datos!$B$85,10,IF(T26=Datos!$B$86,15,IF(T26=Datos!$B$87,20,IF(T26=Datos!$B$88,25,0)))))))/100)","v":0.9}]
[null,null,null,null,null,null,null,null,null,null,null,null,null,null,null,null,null,null,null,null,{"$f":"((IF(Q27=Datos!$B$83,0,IF(Q27=Datos!$B$84,5,IF(Q27=Datos!$B$85,10,IF(Q27=Datos!$B$86,15,IF(Q27=Datos!$B$87,20,IF(Q27=Datos!$B$88,25,0)))))))/100)+((IF(R27=Datos!$B$83,0,IF(R27=Datos!$B$84,5,IF(R27=Datos!$B$85,10,IF(R27=Datos!$B$86,15,IF(R27=Datos!$B$87,20,IF(R27=Datos!$B$88,25,0)))))))/100)+((IF(S27=Datos!$B$83,0,IF(S27=Datos!$B$84,5,IF(S27=Datos!$B$85,10,IF(S27=Datos!$B$86,15,IF(S27=Datos!$B$87,20,IF(S27=Datos!$B$88,25,0)))))))/100)+((IF(T27=Datos!$B$83,0,IF(T27=Datos!$B$84,5,IF(T27=Datos!$B$85,10,IF(T27=Datos!$B$86,15,IF(T27=Datos!$B$87,20,IF(T27=Datos!$B$88,25,0)))))))/100)","v":0}]
[null,null,null,null,null,null,null,null,null,null,null,null,null,null,null,null,null,null,null,null,{"$f":"((IF(Q28=Datos!$B$83,0,IF(Q28=Datos!$B$84,5,IF(Q28=Datos!$B$85,10,IF(Q28=Datos!$B$86,15,IF(Q28=Datos!$B$87,20,IF(Q28=Datos!$B$88,25,0)))))))/100)+((IF(R28=Datos!$B$83,0,IF(R28=Datos!$B$84,5,IF(R28=Datos!$B$85,10,IF(R28=Datos!$B$86,15,IF(R28=Datos!$B$87,20,IF(R28=Datos!$B$88,25,0)))))))/100)+((IF(S28=Datos!$B$83,0,IF(S28=Datos!$B$84,5,IF(S28=Datos!$B$85,10,IF(S28=Datos!$B$86,15,IF(S28=Datos!$B$87,20,IF(S28=Datos!$B$88,25,0)))))))/100)+((IF(T28=Datos!$B$83,0,IF(T28=Datos!$B$84,5,IF(T28=Datos!$B$85,10,IF(T28=Datos!$B$86,15,IF(T28=Datos!$B$87,20,IF(T28=Datos!$B$88,25,0)))))))/100)","v":0}]
[null,"Extensión y Proyección Social",null,{"$f":"IF(B29=\"\",\"-\",VLOOKUP(B29,[1]Datos!$B$4:$C$25,2,FALSE))","v":"Promover la Vinculación de la Universidad Distrital Francisco José de Caldas con su Entorno social, a través de la coordinación de los programas, planes y proyectos de Extensión y Proyección Social, en articulación a la Docencia y la Investigación."}," Deficiente y escaza infraestructura para ejecutar actividades de extensión\n",null,"Interno","Incumplimiento de los programas del ILUD","Incumplimiento de los objetivos, alcances y cronogramas de los planes, programas y servicios a cargo del proceso de Extensión y Proyección Social","Operativos","Pérdida de imagen Institucional","Probable - 4","Moderado - 3",{"$f":"IF(AND(L29=[1]Datos!$B$65,M29=[1]Datos!$B$72),[1]Datos!$D$65,IF(AND(L29=[1]Datos!$B$65,M29=[1]Datos!$B$73),[1]Datos!$E$65,IF(AND(L29=[1]Datos!$B$65,M29=[1]Datos!$B$74),[1]Datos!$F$65,IF(AND(L29=[1]Datos!$B$65,M29=[1]Datos!$B$75),[1]Datos!$G$65,IF(AND(L29=[1]Datos!$B$65,M29=[1]Datos!$B$76),[1]Datos!$H$65,IF(AND(L29=[1]Datos!$B$66,M29=[1]Datos!$B$72),[1]Datos!$D$66,IF(AND(L29=[1]Datos!$B$66,M29=[1]Datos!$B$73),[1]Datos!$E$66,IF(AND(L29=[1]Datos!$B$66,M29=[1]Datos!$B$74),[1]Datos!$F$66,IF(AND(L29=[1]Datos!$B$66,M29=[1]Datos!$B$75),[1]Datos!$G$66,IF(AND(L29=[1]Datos!$B$66,M29=[1]Datos!$B$76),[1]Datos!$H$66,IF(AND(L29=[1]Datos!$B$67,M29=[1]Datos!$B$72),[1]Datos!$D$67,IF(AND(L29=[1]Datos!$B$67,M29=[1]Datos!$B$73),[1]Datos!$E$67,IF(AND(L29=[1]Datos!$B$67,M29=[1]Datos!$B$74),[1]Datos!$F$67,IF(AND(L29=[1]Datos!$B$67,M29=[1]Datos!$B$75),[1]Datos!$G$67,IF(AND(L29=[1]Datos!$B$67,M29=[1]Datos!$B$76),[1]Datos!$H$67,IF(AND(L29=[1]Datos!$B$68,M29=[1]Datos!$B$72),[1]Datos!$D$68,IF(AND(L29=[1]Datos!$B$68,M29=[1]Datos!$B$73),[1]Datos!$E$68,IF(AND(L29=[1]Datos!$B$68,M29=[1]Datos!$B$74),[1]Datos!$F$68,IF(AND(L29=[1]Datos!$B$68,M29=[1]Datos!$B$75),[1]Datos!$G$68,IF(AND(L29=[1]Datos!$B$68,M29=[1]Datos!$B$76),[1]Datos!$H$68,IF(AND(L29=[1]Datos!$B$69,M29=[1]Datos!$B$72),[1]Datos!$D$69,IF(AND(L29=[1]Datos!$B$69,M29=[1]Datos!$B$73),[1]Datos!$E$69,IF(AND(L29=[1]Datos!$B$69,M29=[1]Datos!$B$74),[1]Datos!$F$69,IF(AND(L29=[1]Datos!$B$69,M29=[1]Datos!$B$75),[1]Datos!$G$69,IF(AND(L29=[1]Datos!$B$69,M29=[1]Datos!$B$76),[1]Datos!$H$69,\"-\")))))))))))))))))))))))))","v":"ALTA - IMPORTANTE 12"},"Atención de quejas y reclamos por parte de la comunidad","Preventivo ","Alto - 25","Alto - 25","Alto - 25","Alto - 25",{"$f":"((IF(Q29=[1]Datos!$B$83,0,IF(Q29=[1]Datos!$B$84,5,IF(Q29=[1]Datos!$B$85,10,IF(Q29=[1]Datos!$B$86,15,IF(Q29=[1]Datos!$B$87,20,IF(Q29=[1]Datos!$B$88,25,0)))))))/100)+((IF(R29=[1]Datos!$B$83,0,IF(R29=[1]Datos!$B$84,5,IF(R29=[1]Datos!$B$85,10,IF(R29=[1]Datos!$B$86,15,IF(R29=[1]Datos!$B$87,20,IF(R29=[1]Datos!$B$88,25,0)))))))/100)+((IF(S29=[1]Datos!$B$83,0,IF(S29=[1]Datos!$B$84,5,IF(S29=[1]Datos!$B$85,10,IF(S29=[1]Datos!$B$86,15,IF(S29=[1]Datos!$B$87,20,IF(S29=[1]Datos!$B$88,25,0)))))))/100)+((IF(T29=[1]Datos!$B$83,0,IF(T29=[1]Datos!$B$84,5,IF(T29=[1]Datos!$B$85,10,IF(T29=[1]Datos!$B$86,15,IF(T29=[1]Datos!$B$87,20,IF(T29=[1]Datos!$B$88,25,0)))))))/100)","v":1},{"$f":"IF(ISERROR((IF(P29=[1]Datos!$B$80,[1]SGC!U29,0)+IF(P30=[1]Datos!$B$80,[1]SGC!U30,0)+IF(P31=[1]Datos!$B$80,[1]SGC!U31,0)+IF(P32=[1]Datos!$B$80,[1]SGC!U32,0)+IF(P33=[1]Datos!$B$80,[1]SGC!U33,0)+IF(P34=[1]Datos!$B$80,[1]SGC!U34,0))/(IF(P29=[1]Datos!$B$80,1,0)+IF(P30=[1]Datos!$B$80,1,0)+IF(P31=[1]Datos!$B$80,1,0)+IF(P32=[1]Datos!$B$80,1,0)+IF(P33=[1]Datos!$B$80,1,0)+IF(P34=[1]Datos!$B$80,1,0))),0,(IF(P29=[1]Datos!$B$80,[1]SGC!U29,0)+IF(P30=[1]Datos!$B$80,[1]SGC!U30,0)+IF(P31=[1]Datos!$B$80,[1]SGC!U31,0)+IF(P32=[1]Datos!$B$80,[1]SGC!U32,0)+IF(P33=[1]Datos!$B$80,[1]SGC!U33,0)+IF(P34=[1]Datos!$B$80,[1]SGC!U34,0))/(IF(P29=[1]Datos!$B$80,1,0)+IF(P30=[1]Datos!$B$80,1,0)+IF(P31=[1]Datos!$B$80,1,0)+IF(P32=[1]Datos!$B$80,1,0)+IF(P33=[1]Datos!$B$80,1,0)+IF(P34=[1]Datos!$B$80,1,0)))","v":0.4375},{"$f":"IF(L29=\"\",\"-\",(IF(V29>0,(IF(L29=[1]Datos!$B$65,[1]Datos!$B$65,IF(AND(L29=[1]Datos!$B$66,V29>0.49),[1]Datos!$B$65,IF(AND(L29=[1]Datos!$B$67,V29>0.74),[1]Datos!$B$65,IF(AND(L29=[1]Datos!$B$67,V29<0.75,V29>0.49),[1]Datos!$B$66,IF(AND(L29=[1]Datos!$B$68,V29>0.74),[1]Datos!$B$66,IF(AND(L29=[1]Datos!$B$68,V29<0.75,V29>0.49),[1]Datos!$B$67,IF(AND(L29=[1]Datos!$B$69,V29>0.74),[1]Datos!$B$67,IF(AND(L29=[1]Datos!$B$69,V29<0.75,V29>0.49),[1]Datos!$B$68,L29))))))))),L29)))","v":"Probable - 4"},{"$f":"IF(ISERROR((IF(P29=[1]Datos!$B$79,[1]SGC!U29,0)+IF(P30=[1]Datos!$B$79,[1]SGC!U30,0)+IF(P31=[1]Datos!$B$79,[1]SGC!U31,0)+IF(P32=[1]Datos!$B$79,[1]SGC!U32,0)+IF(P33=[1]Datos!$B$79,[1]SGC!U33,0)+IF(P34=[1]Datos!$B$79,[1]SGC!U34,0))/(IF(P29=[1]Datos!$B$79,1,0)+IF(P30=[1]Datos!$B$79,1,0)+IF(P31=[1]Datos!$B$79,1,0)+IF(P32=[1]Datos!$B$79,1,0)+IF(P33=[1]Datos!$B$79,1,0)+IF(P34=[1]Datos!$B$79,1,0))),0,(IF(P29=[1]Datos!$B$79,[1]SGC!U29,0)+IF(P30=[1]Datos!$B$79,[1]SGC!U30,0)+IF(P31=[1]Datos!$B$79,[1]SGC!U31,0)+IF(P32=[1]Datos!$B$79,[1]SGC!U32,0)+IF(P33=[1]Datos!$B$79,[1]SGC!U33,0)+IF(P34=[1]Datos!$B$79,[1]SGC!U34,0))/(IF(P29=[1]Datos!$B$79,1,0)+IF(P30=[1]Datos!$B$79,1,0)+IF(P31=[1]Datos!$B$79,1,0)+IF(P32=[1]Datos!$B$79,1,0)+IF(P33=[1]Datos!$B$79,1,0)+IF(P34=[1]Datos!$B$79,1,0)))","v":0},{"$f":"IF(M29=\"\",\"-\",(IF(X29>0,(IF(M29=[1]Datos!$B$72,[1]Datos!$B$72,IF(AND(M29=[1]Datos!$B$73,X29>0.49),[1]Datos!$B$72,IF(AND(M29=[1]Datos!$B$74,X29>0.74),[1]Datos!$B$72,IF(AND(M29=[1]Datos!$B$74,X29<0.75,X29>0.49),[1]Datos!$B$73,IF(AND(M29=[1]Datos!$B$75,X29>0.74),[1]Datos!$B$73,IF(AND(M29=[1]Datos!$B$75,X29<0.75,X29>0.49),[1]Datos!$B$74,IF(AND(M29=[1]Datos!$B$76,X29>0.74),[1]Datos!$B$74,IF(AND(M29=[1]Datos!$B$76,X29<0.75,X29>0.49),[1]Datos!$B$75,M29))))))))),M29)))","v":"Moderado - 3"},{"$f":"IF(AND(W29=[1]Datos!$B$65,Y29=[1]Datos!$B$72),[1]Datos!$D$65,IF(AND(W29=[1]Datos!$B$65,Y29=[1]Datos!$B$73),[1]Datos!$E$65,IF(AND(W29=[1]Datos!$B$65,Y29=[1]Datos!$B$74),[1]Datos!$F$65,IF(AND(W29=[1]Datos!$B$65,Y29=[1]Datos!$B$75),[1]Datos!$G$65,IF(AND(W29=[1]Datos!$B$65,Y29=[1]Datos!$B$76),[1]Datos!$H$65,IF(AND(W29=[1]Datos!$B$66,Y29=[1]Datos!$B$72),[1]Datos!$D$66,IF(AND(W29=[1]Datos!$B$66,Y29=[1]Datos!$B$73),[1]Datos!$E$66,IF(AND(W29=[1]Datos!$B$66,Y29=[1]Datos!$B$74),[1]Datos!$F$66,IF(AND(W29=[1]Datos!$B$66,Y29=[1]Datos!$B$75),[1]Datos!$G$66,IF(AND(W29=[1]Datos!$B$66,Y29=[1]Datos!$B$76),[1]Datos!$H$66,IF(AND(W29=[1]Datos!$B$67,Y29=[1]Datos!$B$72),[1]Datos!$D$67,IF(AND(W29=[1]Datos!$B$67,Y29=[1]Datos!$B$73),[1]Datos!$E$67,IF(AND(W29=[1]Datos!$B$67,Y29=[1]Datos!$B$74),[1]Datos!$F$67,IF(AND(W29=[1]Datos!$B$67,Y29=[1]Datos!$B$75),[1]Datos!$G$67,IF(AND(W29=[1]Datos!$B$67,Y29=[1]Datos!$B$76),[1]Datos!$H$67,IF(AND(W29=[1]Datos!$B$68,Y29=[1]Datos!$B$72),[1]Datos!$D$68,IF(AND(W29=[1]Datos!$B$68,Y29=[1]Datos!$B$73),[1]Datos!$E$68,IF(AND(W29=[1]Datos!$B$68,Y29=[1]Datos!$B$74),[1]Datos!$F$68,IF(AND(W29=[1]Datos!$B$68,Y29=[1]Datos!$B$75),[1]Datos!$G$68,IF(AND(W29=[1]Datos!$B$68,Y29=[1]Datos!$B$76),[1]Datos!$H$68,IF(AND(W29=[1]Datos!$B$69,Y29=[1]Datos!$B$72),[1]Datos!$D$69,IF(AND(W29=[1]Datos!$B$69,Y29=[1]Datos!$B$73),[1]Datos!$E$69,IF(AND(W29=[1]Datos!$B$69,Y29=[1]Datos!$B$74),[1]Datos!$F$69,IF(AND(W29=[1]Datos!$B$69,Y29=[1]Datos!$B$75),[1]Datos!$G$69,IF(AND(W29=[1]Datos!$B$69,Y29=[1]Datos!$B$76),[1]Datos!$H$69,\"-\")))))))))))))))))))))))))","v":"ALTA - IMPORTANTE 12"},"Reducir (RE)"]
[null,null,null,null,"Insuficiente disponibilidad presupuestal",null,"Interno",null,null,null,"Bajo impacto de la Universidad en la comunidad\n",null,null,null,"Planeación de la infraestructura necesaria para las actividades de extensión y proyección social","Preventivo ","Alto - 25","Alto - 25","Bajo - 5","Medio - 10",{"$f":"((IF(Q30=[1]Datos!$B$83,0,IF(Q30=[1]Datos!$B$84,5,IF(Q30=[1]Datos!$B$85,10,IF(Q30=[1]Datos!$B$86,15,IF(Q30=[1]Datos!$B$87,20,IF(Q30=[1]Datos!$B$88,25,0)))))))/100)+((IF(R30=[1]Datos!$B$83,0,IF(R30=[1]Datos!$B$84,5,IF(R30=[1]Datos!$B$85,10,IF(R30=[1]Datos!$B$86,15,IF(R30=[1]Datos!$B$87,20,IF(R30=[1]Datos!$B$88,25,0)))))))/100)+((IF(S30=[1]Datos!$B$83,0,IF(S30=[1]Datos!$B$84,5,IF(S30=[1]Datos!$B$85,10,IF(S30=[1]Datos!$B$86,15,IF(S30=[1]Datos!$B$87,20,IF(S30=[1]Datos!$B$88,25,0)))))))/100)+((IF(T30=[1]Datos!$B$83,0,IF(T30=[1]Datos!$B$84,5,IF(T30=[1]Datos!$B$85,10,IF(T30=[1]Datos!$B$86,15,IF(T30=[1]Datos!$B$87,20,IF(T30=[1]Datos!$B$88,25,0)))))))/100)","v":0.65}]
[null,null,null,null,"Falta de seguimiento y control en el   desarrollo de los proyecto",null,"Interno",null,null,null,"Reducción de ingresos ",null,null,null,"Reuniones de seguimiento de los programas de extensión y proyección social","Preventivo ","Alto - 25","Alto - 25","Alto - 25","Alto - 25",{"$f":"((IF(Q31=[1]Datos!$B$83,0,IF(Q31=[1]Datos!$B$84,5,IF(Q31=[1]Datos!$B$85,10,IF(Q31=[1]Datos!$B$86,15,IF(Q31=[1]Datos!$B$87,20,IF(Q31=[1]Datos!$B$88,25,0)))))))/100)+((IF(R31=[1]Datos!$B$83,0,IF(R31=[1]Datos!$B$84,5,IF(R31=[1]Datos!$B$85,10,IF(R31=[1]Datos!$B$86,15,IF(R31=[1]Datos!$B$87,20,IF(R31=[1]Datos!$B$88,25,0)))))))/100)+((IF(S31=[1]Datos!$B$83,0,IF(S31=[1]Datos!$B$84,5,IF(S31=[1]Datos!$B$85,10,IF(S31=[1]Datos!$B$86,15,IF(S31=[1]Datos!$B$87,20,IF(S31=[1]Datos!$B$88,25,0)))))))/100)+((IF(T31=[1]Datos!$B$83,0,IF(T31=[1]Datos!$B$84,5,IF(T31=[1]Datos!$B$85,10,IF(T31=[1]Datos!$B$86,15,IF(T31=[1]Datos!$B$87,20,IF(T31=[1]Datos!$B$88,25,0)))))))/100)","v":1}]
[null,null,null,null,"Alteración del orden público",null,"Externo",null,null,null,"Incumplimiento de la misión de la Universidad ",null,null,null,"Planeación de presupuesto para los cursos de facultad del ILUD","Preventivo ","Alto - 25","Nulo - 0","Nulo - 0","Bajo - 5",{"$f":"((IF(Q32=[1]Datos!$B$83,0,IF(Q32=[1]Datos!$B$84,5,IF(Q32=[1]Datos!$B$85,10,IF(Q32=[1]Datos!$B$86,15,IF(Q32=[1]Datos!$B$87,20,IF(Q32=[1]Datos!$B$88,25,0)))))))/100)+((IF(R32=[1]Datos!$B$83,0,IF(R32=[1]Datos!$B$84,5,IF(R32=[1]Datos!$B$85,10,IF(R32=[1]Datos!$B$86,15,IF(R32=[1]Datos!$B$87,20,IF(R32=[1]Datos!$B$88,25,0)))))))/100)+((IF(S32=[1]Datos!$B$83,0,IF(S32=[1]Datos!$B$84,5,IF(S32=[1]Datos!$B$85,10,IF(S32=[1]Datos!$B$86,15,IF(S32=[1]Datos!$B$87,20,IF(S32=[1]Datos!$B$88,25,0)))))))/100)+((IF(T32=[1]Datos!$B$83,0,IF(T32=[1]Datos!$B$84,5,IF(T32=[1]Datos!$B$85,10,IF(T32=[1]Datos!$B$86,15,IF(T32=[1]Datos!$B$87,20,IF(T32=[1]Datos!$B$88,25,0)))))))/100)","v":0.3}]
[null,null,null,null,"Falta de personal administrativo y docente de planta",null,"Interno",null,null,null,null,null,null,null,null,null,null,null,null,null,{"$f":"((IF(Q33=[1]Datos!$B$83,0,IF(Q33=[1]Datos!$B$84,5,IF(Q33=[1]Datos!$B$85,10,IF(Q33=[1]Datos!$B$86,15,IF(Q33=[1]Datos!$B$87,20,IF(Q33=[1]Datos!$B$88,25,0)))))))/100)+((IF(R33=[1]Datos!$B$83,0,IF(R33=[1]Datos!$B$84,5,IF(R33=[1]Datos!$B$85,10,IF(R33=[1]Datos!$B$86,15,IF(R33=[1]Datos!$B$87,20,IF(R33=[1]Datos!$B$88,25,0)))))))/100)+((IF(S33=[1]Datos!$B$83,0,IF(S33=[1]Datos!$B$84,5,IF(S33=[1]Datos!$B$85,10,IF(S33=[1]Datos!$B$86,15,IF(S33=[1]Datos!$B$87,20,IF(S33=[1]Datos!$B$88,25,0)))))))/100)+((IF(T33=[1]Datos!$B$83,0,IF(T33=[1]Datos!$B$84,5,IF(T33=[1]Datos!$B$85,10,IF(T33=[1]Datos!$B$86,15,IF(T33=[1]Datos!$B$87,20,IF(T33=[1]Datos!$B$88,25,0)))))))/100)","v":0}]
[null,null,null,null,null,null,null,null,null,null,null,null,null,null,null,null,null,null,null,null,{"$f":"((IF(Q34=[1]Datos!$B$83,0,IF(Q34=[1]Datos!$B$84,5,IF(Q34=[1]Datos!$B$85,10,IF(Q34=[1]Datos!$B$86,15,IF(Q34=[1]Datos!$B$87,20,IF(Q34=[1]Datos!$B$88,25,0)))))))/100)+((IF(R34=[1]Datos!$B$83,0,IF(R34=[1]Datos!$B$84,5,IF(R34=[1]Datos!$B$85,10,IF(R34=[1]Datos!$B$86,15,IF(R34=[1]Datos!$B$87,20,IF(R34=[1]Datos!$B$88,25,0)))))))/100)+((IF(S34=[1]Datos!$B$83,0,IF(S34=[1]Datos!$B$84,5,IF(S34=[1]Datos!$B$85,10,IF(S34=[1]Datos!$B$86,15,IF(S34=[1]Datos!$B$87,20,IF(S34=[1]Datos!$B$88,25,0)))))))/100)+((IF(T34=[1]Datos!$B$83,0,IF(T34=[1]Datos!$B$84,5,IF(T34=[1]Datos!$B$85,10,IF(T34=[1]Datos!$B$86,15,IF(T34=[1]Datos!$B$87,20,IF(T34=[1]Datos!$B$88,25,0)))))))/100)","v":0}]
[null,"Extensión y Proyección Social",null,{"$f":"IF(B35=\"\",\"-\",VLOOKUP(B35,[1]Datos!$B$4:$C$25,2,FALSE))","v":"Promover la Vinculación de la Universidad Distrital Francisco José de Caldas con su Entorno social, a través de la coordinación de los programas, planes y proyectos de Extensión y Proyección Social, en articulación a la Docencia y la Investigación."},"Disminución presupuestal",null,"Interno","Disminución de la\ncalidad de los servicios\nprestados","Se refiere a la inadecuada prestación de los\nservicios de extensión y proyección social  y de los cursos de facultad de segunda lengua","Operativos","Baja calificación en los indicadores de gestión","Improbable - 2","Mayor - 4",{"$f":"IF(AND(L35=[1]Datos!$B$65,M35=[1]Datos!$B$72),[1]Datos!$D$65,IF(AND(L35=[1]Datos!$B$65,M35=[1]Datos!$B$73),[1]Datos!$E$65,IF(AND(L35=[1]Datos!$B$65,M35=[1]Datos!$B$74),[1]Datos!$F$65,IF(AND(L35=[1]Datos!$B$65,M35=[1]Datos!$B$75),[1]Datos!$G$65,IF(AND(L35=[1]Datos!$B$65,M35=[1]Datos!$B$76),[1]Datos!$H$65,IF(AND(L35=[1]Datos!$B$66,M35=[1]Datos!$B$72),[1]Datos!$D$66,IF(AND(L35=[1]Datos!$B$66,M35=[1]Datos!$B$73),[1]Datos!$E$66,IF(AND(L35=[1]Datos!$B$66,M35=[1]Datos!$B$74),[1]Datos!$F$66,IF(AND(L35=[1]Datos!$B$66,M35=[1]Datos!$B$75),[1]Datos!$G$66,IF(AND(L35=[1]Datos!$B$66,M35=[1]Datos!$B$76),[1]Datos!$H$66,IF(AND(L35=[1]Datos!$B$67,M35=[1]Datos!$B$72),[1]Datos!$D$67,IF(AND(L35=[1]Datos!$B$67,M35=[1]Datos!$B$73),[1]Datos!$E$67,IF(AND(L35=[1]Datos!$B$67,M35=[1]Datos!$B$74),[1]Datos!$F$67,IF(AND(L35=[1]Datos!$B$67,M35=[1]Datos!$B$75),[1]Datos!$G$67,IF(AND(L35=[1]Datos!$B$67,M35=[1]Datos!$B$76),[1]Datos!$H$67,IF(AND(L35=[1]Datos!$B$68,M35=[1]Datos!$B$72),[1]Datos!$D$68,IF(AND(L35=[1]Datos!$B$68,M35=[1]Datos!$B$73),[1]Datos!$E$68,IF(AND(L35=[1]Datos!$B$68,M35=[1]Datos!$B$74),[1]Datos!$F$68,IF(AND(L35=[1]Datos!$B$68,M35=[1]Datos!$B$75),[1]Datos!$G$68,IF(AND(L35=[1]Datos!$B$68,M35=[1]Datos!$B$76),[1]Datos!$H$68,IF(AND(L35=[1]Datos!$B$69,M35=[1]Datos!$B$72),[1]Datos!$D$69,IF(AND(L35=[1]Datos!$B$69,M35=[1]Datos!$B$73),[1]Datos!$E$69,IF(AND(L35=[1]Datos!$B$69,M35=[1]Datos!$B$74),[1]Datos!$F$69,IF(AND(L35=[1]Datos!$B$69,M35=[1]Datos!$B$75),[1]Datos!$G$69,IF(AND(L35=[1]Datos!$B$69,M35=[1]Datos!$B$76),[1]Datos!$H$69,\"-\")))))))))))))))))))))))))","v":"ALTA-IMPORTANTE 8"},"Seguimiento de los resultados de los  servicios del ILUD","Preventivo ","Alto - 25","Alto - 25","Alto - 25","Alto - 25",{"$f":"((IF(Q35=[1]Datos!$B$83,0,IF(Q35=[1]Datos!$B$84,5,IF(Q35=[1]Datos!$B$85,10,IF(Q35=[1]Datos!$B$86,15,IF(Q35=[1]Datos!$B$87,20,IF(Q35=[1]Datos!$B$88,25,0)))))))/100)+((IF(R35=[1]Datos!$B$83,0,IF(R35=[1]Datos!$B$84,5,IF(R35=[1]Datos!$B$85,10,IF(R35=[1]Datos!$B$86,15,IF(R35=[1]Datos!$B$87,20,IF(R35=[1]Datos!$B$88,25,0)))))))/100)+((IF(S35=[1]Datos!$B$83,0,IF(S35=[1]Datos!$B$84,5,IF(S35=[1]Datos!$B$85,10,IF(S35=[1]Datos!$B$86,15,IF(S35=[1]Datos!$B$87,20,IF(S35=[1]Datos!$B$88,25,0)))))))/100)+((IF(T35=[1]Datos!$B$83,0,IF(T35=[1]Datos!$B$84,5,IF(T35=[1]Datos!$B$85,10,IF(T35=[1]Datos!$B$86,15,IF(T35=[1]Datos!$B$87,20,IF(T35=[1]Datos!$B$88,25,0)))))))/100)","v":1},{"$f":"IF(ISERROR((IF(P35=[1]Datos!$B$80,[1]SGC!U35,0)+IF(P36=[1]Datos!$B$80,[1]SGC!U36,0)+IF(P37=[1]Datos!$B$80,[1]SGC!U37,0)+IF(P38=[1]Datos!$B$80,[1]SGC!U38,0)+IF(P39=[1]Datos!$B$80,[1]SGC!U39,0)+IF(P40=[1]Datos!$B$80,[1]SGC!U40,0))/(IF(P35=[1]Datos!$B$80,1,0)+IF(P36=[1]Datos!$B$80,1,0)+IF(P37=[1]Datos!$B$80,1,0)+IF(P38=[1]Datos!$B$80,1,0)+IF(P39=[1]Datos!$B$80,1,0)+IF(P40=[1]Datos!$B$80,1,0))),0,(IF(P35=[1]Datos!$B$80,[1]SGC!U35,0)+IF(P36=[1]Datos!$B$80,[1]SGC!U36,0)+IF(P37=[1]Datos!$B$80,[1]SGC!U37,0)+IF(P38=[1]Datos!$B$80,[1]SGC!U38,0)+IF(P39=[1]Datos!$B$80,[1]SGC!U39,0)+IF(P40=[1]Datos!$B$80,[1]SGC!U40,0))/(IF(P35=[1]Datos!$B$80,1,0)+IF(P36=[1]Datos!$B$80,1,0)+IF(P37=[1]Datos!$B$80,1,0)+IF(P38=[1]Datos!$B$80,1,0)+IF(P39=[1]Datos!$B$80,1,0)+IF(P40=[1]Datos!$B$80,1,0)))","v":0},{"$f":"IF(L35=\"\",\"-\",(IF(V35>0,(IF(L35=[1]Datos!$B$65,[1]Datos!$B$65,IF(AND(L35=[1]Datos!$B$66,V35>0.49),[1]Datos!$B$65,IF(AND(L35=[1]Datos!$B$67,V35>0.74),[1]Datos!$B$65,IF(AND(L35=[1]Datos!$B$67,V35<0.75,V35>0.49),[1]Datos!$B$66,IF(AND(L35=[1]Datos!$B$68,V35>0.74),[1]Datos!$B$66,IF(AND(L35=[1]Datos!$B$68,V35<0.75,V35>0.49),[1]Datos!$B$67,IF(AND(L35=[1]Datos!$B$69,V35>0.74),[1]Datos!$B$67,IF(AND(L35=[1]Datos!$B$69,V35<0.75,V35>0.49),[1]Datos!$B$68,L35))))))))),L35)))","v":"Improbable - 2"},{"$f":"IF(ISERROR((IF(P35=[1]Datos!$B$79,[1]SGC!U35,0)+IF(P36=[1]Datos!$B$79,[1]SGC!U36,0)+IF(P37=[1]Datos!$B$79,[1]SGC!U37,0)+IF(P38=[1]Datos!$B$79,[1]SGC!U38,0)+IF(P39=[1]Datos!$B$79,[1]SGC!U39,0)+IF(P40=[1]Datos!$B$79,[1]SGC!U40,0))/(IF(P35=[1]Datos!$B$79,1,0)+IF(P36=[1]Datos!$B$79,1,0)+IF(P37=[1]Datos!$B$79,1,0)+IF(P38=[1]Datos!$B$79,1,0)+IF(P39=[1]Datos!$B$79,1,0)+IF(P40=[1]Datos!$B$79,1,0))),0,(IF(P35=[1]Datos!$B$79,[1]SGC!U35,0)+IF(P36=[1]Datos!$B$79,[1]SGC!U36,0)+IF(P37=[1]Datos!$B$79,[1]SGC!U37,0)+IF(P38=[1]Datos!$B$79,[1]SGC!U38,0)+IF(P39=[1]Datos!$B$79,[1]SGC!U39,0)+IF(P40=[1]Datos!$B$79,[1]SGC!U40,0))/(IF(P35=[1]Datos!$B$79,1,0)+IF(P36=[1]Datos!$B$79,1,0)+IF(P37=[1]Datos!$B$79,1,0)+IF(P38=[1]Datos!$B$79,1,0)+IF(P39=[1]Datos!$B$79,1,0)+IF(P40=[1]Datos!$B$79,1,0)))","v":0},{"$f":"IF(M35=\"\",\"-\",(IF(X35>0,(IF(M35=[1]Datos!$B$72,[1]Datos!$B$72,IF(AND(M35=[1]Datos!$B$73,X35>0.49),[1]Datos!$B$72,IF(AND(M35=[1]Datos!$B$74,X35>0.74),[1]Datos!$B$72,IF(AND(M35=[1]Datos!$B$74,X35<0.75,X35>0.49),[1]Datos!$B$73,IF(AND(M35=[1]Datos!$B$75,X35>0.74),[1]Datos!$B$73,IF(AND(M35=[1]Datos!$B$75,X35<0.75,X35>0.49),[1]Datos!$B$74,IF(AND(M35=[1]Datos!$B$76,X35>0.74),[1]Datos!$B$74,IF(AND(M35=[1]Datos!$B$76,X35<0.75,X35>0.49),[1]Datos!$B$75,M35))))))))),M35)))","v":"Mayor - 4"},{"$f":"IF(AND(W35=[1]Datos!$B$65,Y35=[1]Datos!$B$72),[1]Datos!$D$65,IF(AND(W35=[1]Datos!$B$65,Y35=[1]Datos!$B$73),[1]Datos!$E$65,IF(AND(W35=[1]Datos!$B$65,Y35=[1]Datos!$B$74),[1]Datos!$F$65,IF(AND(W35=[1]Datos!$B$65,Y35=[1]Datos!$B$75),[1]Datos!$G$65,IF(AND(W35=[1]Datos!$B$65,Y35=[1]Datos!$B$76),[1]Datos!$H$65,IF(AND(W35=[1]Datos!$B$66,Y35=[1]Datos!$B$72),[1]Datos!$D$66,IF(AND(W35=[1]Datos!$B$66,Y35=[1]Datos!$B$73),[1]Datos!$E$66,IF(AND(W35=[1]Datos!$B$66,Y35=[1]Datos!$B$74),[1]Datos!$F$66,IF(AND(W35=[1]Datos!$B$66,Y35=[1]Datos!$B$75),[1]Datos!$G$66,IF(AND(W35=[1]Datos!$B$66,Y35=[1]Datos!$B$76),[1]Datos!$H$66,IF(AND(W35=[1]Datos!$B$67,Y35=[1]Datos!$B$72),[1]Datos!$D$67,IF(AND(W35=[1]Datos!$B$67,Y35=[1]Datos!$B$73),[1]Datos!$E$67,IF(AND(W35=[1]Datos!$B$67,Y35=[1]Datos!$B$74),[1]Datos!$F$67,IF(AND(W35=[1]Datos!$B$67,Y35=[1]Datos!$B$75),[1]Datos!$G$67,IF(AND(W35=[1]Datos!$B$67,Y35=[1]Datos!$B$76),[1]Datos!$H$67,IF(AND(W35=[1]Datos!$B$68,Y35=[1]Datos!$B$72),[1]Datos!$D$68,IF(AND(W35=[1]Datos!$B$68,Y35=[1]Datos!$B$73),[1]Datos!$E$68,IF(AND(W35=[1]Datos!$B$68,Y35=[1]Datos!$B$74),[1]Datos!$F$68,IF(AND(W35=[1]Datos!$B$68,Y35=[1]Datos!$B$75),[1]Datos!$G$68,IF(AND(W35=[1]Datos!$B$68,Y35=[1]Datos!$B$76),[1]Datos!$H$68,IF(AND(W35=[1]Datos!$B$69,Y35=[1]Datos!$B$72),[1]Datos!$D$69,IF(AND(W35=[1]Datos!$B$69,Y35=[1]Datos!$B$73),[1]Datos!$E$69,IF(AND(W35=[1]Datos!$B$69,Y35=[1]Datos!$B$74),[1]Datos!$F$69,IF(AND(W35=[1]Datos!$B$69,Y35=[1]Datos!$B$75),[1]Datos!$G$69,IF(AND(W35=[1]Datos!$B$69,Y35=[1]Datos!$B$76),[1]Datos!$H$69,\"-\")))))))))))))))))))))))))","v":"ALTA-IMPORTANTE 8"},"Reducir (RE)"]
[null,null,null,null,"Falta de docentes de planta",null,"Interno",null,null,null,"Bajo reconocimiento de la gestión de la unidad de extensión y proyección social",null,null,null,"Formación y actualización de docentes","Preventivo ","Alto - 25","Alto - 25","Alto - 25","Alto - 25",{"$f":"((IF(Q36=[1]Datos!$B$83,0,IF(Q36=[1]Datos!$B$84,5,IF(Q36=[1]Datos!$B$85,10,IF(Q36=[1]Datos!$B$86,15,IF(Q36=[1]Datos!$B$87,20,IF(Q36=[1]Datos!$B$88,25,0)))))))/100)+((IF(R36=[1]Datos!$B$83,0,IF(R36=[1]Datos!$B$84,5,IF(R36=[1]Datos!$B$85,10,IF(R36=[1]Datos!$B$86,15,IF(R36=[1]Datos!$B$87,20,IF(R36=[1]Datos!$B$88,25,0)))))))/100)+((IF(S36=[1]Datos!$B$83,0,IF(S36=[1]Datos!$B$84,5,IF(S36=[1]Datos!$B$85,10,IF(S36=[1]Datos!$B$86,15,IF(S36=[1]Datos!$B$87,20,IF(S36=[1]Datos!$B$88,25,0)))))))/100)+((IF(T36=[1]Datos!$B$83,0,IF(T36=[1]Datos!$B$84,5,IF(T36=[1]Datos!$B$85,10,IF(T36=[1]Datos!$B$86,15,IF(T36=[1]Datos!$B$87,20,IF(T36=[1]Datos!$B$88,25,0)))))))/100)","v":1}]
[null,null,null,null,"No se realiza un seguimiento a los servicios prestados",null,"Interno",null,null,null,"Incumplimiento de los objetivos del Proceso de Extensión y Proyección Social",null,null,null,"Continuidad de personal docente y administrativo","Preventivo ","Nulo - 0","Nulo - 0","Nulo - 0","Nulo - 0",{"$f":"((IF(Q37=[1]Datos!$B$83,0,IF(Q37=[1]Datos!$B$84,5,IF(Q37=[1]Datos!$B$85,10,IF(Q37=[1]Datos!$B$86,15,IF(Q37=[1]Datos!$B$87,20,IF(Q37=[1]Datos!$B$88,25,0)))))))/100)+((IF(R37=[1]Datos!$B$83,0,IF(R37=[1]Datos!$B$84,5,IF(R37=[1]Datos!$B$85,10,IF(R37=[1]Datos!$B$86,15,IF(R37=[1]Datos!$B$87,20,IF(R37=[1]Datos!$B$88,25,0)))))))/100)+((IF(S37=[1]Datos!$B$83,0,IF(S37=[1]Datos!$B$84,5,IF(S37=[1]Datos!$B$85,10,IF(S37=[1]Datos!$B$86,15,IF(S37=[1]Datos!$B$87,20,IF(S37=[1]Datos!$B$88,25,0)))))))/100)+((IF(T37=[1]Datos!$B$83,0,IF(T37=[1]Datos!$B$84,5,IF(T37=[1]Datos!$B$85,10,IF(T37=[1]Datos!$B$86,15,IF(T37=[1]Datos!$B$87,20,IF(T37=[1]Datos!$B$88,25,0)))))))/100)","v":0}]
[null,null,null,null,null,null,null,null,null,null,"Aumento del número de quejas y reclamos",null,null,null,null,null,null,null,null,null,{"$f":"((IF(Q38=[1]Datos!$B$83,0,IF(Q38=[1]Datos!$B$84,5,IF(Q38=[1]Datos!$B$85,10,IF(Q38=[1]Datos!$B$86,15,IF(Q38=[1]Datos!$B$87,20,IF(Q38=[1]Datos!$B$88,25,0)))))))/100)+((IF(R38=[1]Datos!$B$83,0,IF(R38=[1]Datos!$B$84,5,IF(R38=[1]Datos!$B$85,10,IF(R38=[1]Datos!$B$86,15,IF(R38=[1]Datos!$B$87,20,IF(R38=[1]Datos!$B$88,25,0)))))))/100)+((IF(S38=[1]Datos!$B$83,0,IF(S38=[1]Datos!$B$84,5,IF(S38=[1]Datos!$B$85,10,IF(S38=[1]Datos!$B$86,15,IF(S38=[1]Datos!$B$87,20,IF(S38=[1]Datos!$B$88,25,0)))))))/100)+((IF(T38=[1]Datos!$B$83,0,IF(T38=[1]Datos!$B$84,5,IF(T38=[1]Datos!$B$85,10,IF(T38=[1]Datos!$B$86,15,IF(T38=[1]Datos!$B$87,20,IF(T38=[1]Datos!$B$88,25,0)))))))/100)","v":0}]
[null,null,null,null,null,null,null,null,null,null,"Perdida de imagen al exterior y al interior del espacio académico de segunda lengua  de la Universidad ",null,null,null,null,null,null,null,null,null,{"$f":"((IF(Q39=[1]Datos!$B$83,0,IF(Q39=[1]Datos!$B$84,5,IF(Q39=[1]Datos!$B$85,10,IF(Q39=[1]Datos!$B$86,15,IF(Q39=[1]Datos!$B$87,20,IF(Q39=[1]Datos!$B$88,25,0)))))))/100)+((IF(R39=[1]Datos!$B$83,0,IF(R39=[1]Datos!$B$84,5,IF(R39=[1]Datos!$B$85,10,IF(R39=[1]Datos!$B$86,15,IF(R39=[1]Datos!$B$87,20,IF(R39=[1]Datos!$B$88,25,0)))))))/100)+((IF(S39=[1]Datos!$B$83,0,IF(S39=[1]Datos!$B$84,5,IF(S39=[1]Datos!$B$85,10,IF(S39=[1]Datos!$B$86,15,IF(S39=[1]Datos!$B$87,20,IF(S39=[1]Datos!$B$88,25,0)))))))/100)+((IF(T39=[1]Datos!$B$83,0,IF(T39=[1]Datos!$B$84,5,IF(T39=[1]Datos!$B$85,10,IF(T39=[1]Datos!$B$86,15,IF(T39=[1]Datos!$B$87,20,IF(T39=[1]Datos!$B$88,25,0)))))))/100)","v":0}]
[null,null,null,null,null,null,null,null,null,null,null,null,null,null,null,null,null,null,null,null,{"$f":"((IF(Q40=[1]Datos!$B$83,0,IF(Q40=[1]Datos!$B$84,5,IF(Q40=[1]Datos!$B$85,10,IF(Q40=[1]Datos!$B$86,15,IF(Q40=[1]Datos!$B$87,20,IF(Q40=[1]Datos!$B$88,25,0)))))))/100)+((IF(R40=[1]Datos!$B$83,0,IF(R40=[1]Datos!$B$84,5,IF(R40=[1]Datos!$B$85,10,IF(R40=[1]Datos!$B$86,15,IF(R40=[1]Datos!$B$87,20,IF(R40=[1]Datos!$B$88,25,0)))))))/100)+((IF(S40=[1]Datos!$B$83,0,IF(S40=[1]Datos!$B$84,5,IF(S40=[1]Datos!$B$85,10,IF(S40=[1]Datos!$B$86,15,IF(S40=[1]Datos!$B$87,20,IF(S40=[1]Datos!$B$88,25,0)))))))/100)+((IF(T40=[1]Datos!$B$83,0,IF(T40=[1]Datos!$B$84,5,IF(T40=[1]Datos!$B$85,10,IF(T40=[1]Datos!$B$86,15,IF(T40=[1]Datos!$B$87,20,IF(T40=[1]Datos!$B$88,25,0)))))))/100)","v":0}]
[null,"Extensión y Proyección Social",null,{"$f":"IF(B41=\"\",\"-\",VLOOKUP(B41,[1]Datos!$B$4:$C$25,2,FALSE))","v":"Promover la Vinculación de la Universidad Distrital Francisco José de Caldas con su Entorno social, a través de la coordinación de los programas, planes y proyectos de Extensión y Proyección Social, en articulación a la Docencia y la Investigación."},"Falta de conocimiento de las actividades de Extensión y Proyección social por parte de los estudiantes                                  ",null,"Interno","Baja participación de los estudiantes de la Universidad en las actividades de Extensión y Proyección Social","Hace referencia al bajo número de estudiantes matriculados en la Universidad Distrital Francisco José de Caldas vinculados a las actividades de Extensión y Proyección Social ","Operativos","Pérdida de imagen del instituto","Posible - 3","Moderado - 3",{"$f":"IF(AND(L41=[1]Datos!$B$65,M41=[1]Datos!$B$72),[1]Datos!$D$65,IF(AND(L41=[1]Datos!$B$65,M41=[1]Datos!$B$73),[1]Datos!$E$65,IF(AND(L41=[1]Datos!$B$65,M41=[1]Datos!$B$74),[1]Datos!$F$65,IF(AND(L41=[1]Datos!$B$65,M41=[1]Datos!$B$75),[1]Datos!$G$65,IF(AND(L41=[1]Datos!$B$65,M41=[1]Datos!$B$76),[1]Datos!$H$65,IF(AND(L41=[1]Datos!$B$66,M41=[1]Datos!$B$72),[1]Datos!$D$66,IF(AND(L41=[1]Datos!$B$66,M41=[1]Datos!$B$73),[1]Datos!$E$66,IF(AND(L41=[1]Datos!$B$66,M41=[1]Datos!$B$74),[1]Datos!$F$66,IF(AND(L41=[1]Datos!$B$66,M41=[1]Datos!$B$75),[1]Datos!$G$66,IF(AND(L41=[1]Datos!$B$66,M41=[1]Datos!$B$76),[1]Datos!$H$66,IF(AND(L41=[1]Datos!$B$67,M41=[1]Datos!$B$72),[1]Datos!$D$67,IF(AND(L41=[1]Datos!$B$67,M41=[1]Datos!$B$73),[1]Datos!$E$67,IF(AND(L41=[1]Datos!$B$67,M41=[1]Datos!$B$74),[1]Datos!$F$67,IF(AND(L41=[1]Datos!$B$67,M41=[1]Datos!$B$75),[1]Datos!$G$67,IF(AND(L41=[1]Datos!$B$67,M41=[1]Datos!$B$76),[1]Datos!$H$67,IF(AND(L41=[1]Datos!$B$68,M41=[1]Datos!$B$72),[1]Datos!$D$68,IF(AND(L41=[1]Datos!$B$68,M41=[1]Datos!$B$73),[1]Datos!$E$68,IF(AND(L41=[1]Datos!$B$68,M41=[1]Datos!$B$74),[1]Datos!$F$68,IF(AND(L41=[1]Datos!$B$68,M41=[1]Datos!$B$75),[1]Datos!$G$68,IF(AND(L41=[1]Datos!$B$68,M41=[1]Datos!$B$76),[1]Datos!$H$68,IF(AND(L41=[1]Datos!$B$69,M41=[1]Datos!$B$72),[1]Datos!$D$69,IF(AND(L41=[1]Datos!$B$69,M41=[1]Datos!$B$73),[1]Datos!$E$69,IF(AND(L41=[1]Datos!$B$69,M41=[1]Datos!$B$74),[1]Datos!$F$69,IF(AND(L41=[1]Datos!$B$69,M41=[1]Datos!$B$75),[1]Datos!$G$69,IF(AND(L41=[1]Datos!$B$69,M41=[1]Datos!$B$76),[1]Datos!$H$69,\"-\")))))))))))))))))))))))))","v":"ALTA - IMPORTANTE 9"},"Plan de difusión de las actividades de Extensión y Proyección Social  al interior de la universidad","Preventivo ","Alto - 25","Bajo - 5","Bajo - 5","Nulo - 0",{"$f":"((IF(Q41=[1]Datos!$B$83,0,IF(Q41=[1]Datos!$B$84,5,IF(Q41=[1]Datos!$B$85,10,IF(Q41=[1]Datos!$B$86,15,IF(Q41=[1]Datos!$B$87,20,IF(Q41=[1]Datos!$B$88,25,0)))))))/100)+((IF(R41=[1]Datos!$B$83,0,IF(R41=[1]Datos!$B$84,5,IF(R41=[1]Datos!$B$85,10,IF(R41=[1]Datos!$B$86,15,IF(R41=[1]Datos!$B$87,20,IF(R41=[1]Datos!$B$88,25,0)))))))/100)+((IF(S41=[1]Datos!$B$83,0,IF(S41=[1]Datos!$B$84,5,IF(S41=[1]Datos!$B$85,10,IF(S41=[1]Datos!$B$86,15,IF(S41=[1]Datos!$B$87,20,IF(S41=[1]Datos!$B$88,25,0)))))))/100)+((IF(T41=[1]Datos!$B$83,0,IF(T41=[1]Datos!$B$84,5,IF(T41=[1]Datos!$B$85,10,IF(T41=[1]Datos!$B$86,15,IF(T41=[1]Datos!$B$87,20,IF(T41=[1]Datos!$B$88,25,0)))))))/100)","v":0.35},{"$f":"IF(ISERROR((IF(P41=[1]Datos!$B$80,[1]SGC!U41,0)+IF(P42=[1]Datos!$B$80,[1]SGC!U42,0)+IF(P43=[1]Datos!$B$80,[1]SGC!U43,0)+IF(P44=[1]Datos!$B$80,[1]SGC!U44,0)+IF(P45=[1]Datos!$B$80,[1]SGC!U45,0)+IF(P46=[1]Datos!$B$80,[1]SGC!U46,0))/(IF(P41=[1]Datos!$B$80,1,0)+IF(P42=[1]Datos!$B$80,1,0)+IF(P43=[1]Datos!$B$80,1,0)+IF(P44=[1]Datos!$B$80,1,0)+IF(P45=[1]Datos!$B$80,1,0)+IF(P46=[1]Datos!$B$80,1,0))),0,(IF(P41=[1]Datos!$B$80,[1]SGC!U41,0)+IF(P42=[1]Datos!$B$80,[1]SGC!U42,0)+IF(P43=[1]Datos!$B$80,[1]SGC!U43,0)+IF(P44=[1]Datos!$B$80,[1]SGC!U44,0)+IF(P45=[1]Datos!$B$80,[1]SGC!U45,0)+IF(P46=[1]Datos!$B$80,[1]SGC!U46,0))/(IF(P41=[1]Datos!$B$80,1,0)+IF(P42=[1]Datos!$B$80,1,0)+IF(P43=[1]Datos!$B$80,1,0)+IF(P44=[1]Datos!$B$80,1,0)+IF(P45=[1]Datos!$B$80,1,0)+IF(P46=[1]Datos!$B$80,1,0)))","v":0},{"$f":"IF(L41=\"\",\"-\",(IF(V41>0,(IF(L41=[1]Datos!$B$65,[1]Datos!$B$65,IF(AND(L41=[1]Datos!$B$66,V41>0.49),[1]Datos!$B$65,IF(AND(L41=[1]Datos!$B$67,V41>0.74),[1]Datos!$B$65,IF(AND(L41=[1]Datos!$B$67,V41<0.75,V41>0.49),[1]Datos!$B$66,IF(AND(L41=[1]Datos!$B$68,V41>0.74),[1]Datos!$B$66,IF(AND(L41=[1]Datos!$B$68,V41<0.75,V41>0.49),[1]Datos!$B$67,IF(AND(L41=[1]Datos!$B$69,V41>0.74),[1]Datos!$B$67,IF(AND(L41=[1]Datos!$B$69,V41<0.75,V41>0.49),[1]Datos!$B$68,L41))))))))),L41)))","v":"Posible - 3"},{"$f":"IF(ISERROR((IF(P41=[1]Datos!$B$79,[1]SGC!U41,0)+IF(P42=[1]Datos!$B$79,[1]SGC!U42,0)+IF(P43=[1]Datos!$B$79,[1]SGC!U43,0)+IF(P44=[1]Datos!$B$79,[1]SGC!U44,0)+IF(P45=[1]Datos!$B$79,[1]SGC!U45,0)+IF(P46=[1]Datos!$B$79,[1]SGC!U46,0))/(IF(P41=[1]Datos!$B$79,1,0)+IF(P42=[1]Datos!$B$79,1,0)+IF(P43=[1]Datos!$B$79,1,0)+IF(P44=[1]Datos!$B$79,1,0)+IF(P45=[1]Datos!$B$79,1,0)+IF(P46=[1]Datos!$B$79,1,0))),0,(IF(P41=[1]Datos!$B$79,[1]SGC!U41,0)+IF(P42=[1]Datos!$B$79,[1]SGC!U42,0)+IF(P43=[1]Datos!$B$79,[1]SGC!U43,0)+IF(P44=[1]Datos!$B$79,[1]SGC!U44,0)+IF(P45=[1]Datos!$B$79,[1]SGC!U45,0)+IF(P46=[1]Datos!$B$79,[1]SGC!U46,0))/(IF(P41=[1]Datos!$B$79,1,0)+IF(P42=[1]Datos!$B$79,1,0)+IF(P43=[1]Datos!$B$79,1,0)+IF(P44=[1]Datos!$B$79,1,0)+IF(P45=[1]Datos!$B$79,1,0)+IF(P46=[1]Datos!$B$79,1,0)))","v":0},{"$f":"IF(M41=\"\",\"-\",(IF(X41>0,(IF(M41=[1]Datos!$B$72,[1]Datos!$B$72,IF(AND(M41=[1]Datos!$B$73,X41>0.49),[1]Datos!$B$72,IF(AND(M41=[1]Datos!$B$74,X41>0.74),[1]Datos!$B$72,IF(AND(M41=[1]Datos!$B$74,X41<0.75,X41>0.49),[1]Datos!$B$73,IF(AND(M41=[1]Datos!$B$75,X41>0.74),[1]Datos!$B$73,IF(AND(M41=[1]Datos!$B$75,X41<0.75,X41>0.49),[1]Datos!$B$74,IF(AND(M41=[1]Datos!$B$76,X41>0.74),[1]Datos!$B$74,IF(AND(M41=[1]Datos!$B$76,X41<0.75,X41>0.49),[1]Datos!$B$75,M41))))))))),M41)))","v":"Moderado - 3"},{"$f":"IF(AND(W41=[1]Datos!$B$65,Y41=[1]Datos!$B$72),[1]Datos!$D$65,IF(AND(W41=[1]Datos!$B$65,Y41=[1]Datos!$B$73),[1]Datos!$E$65,IF(AND(W41=[1]Datos!$B$65,Y41=[1]Datos!$B$74),[1]Datos!$F$65,IF(AND(W41=[1]Datos!$B$65,Y41=[1]Datos!$B$75),[1]Datos!$G$65,IF(AND(W41=[1]Datos!$B$65,Y41=[1]Datos!$B$76),[1]Datos!$H$65,IF(AND(W41=[1]Datos!$B$66,Y41=[1]Datos!$B$72),[1]Datos!$D$66,IF(AND(W41=[1]Datos!$B$66,Y41=[1]Datos!$B$73),[1]Datos!$E$66,IF(AND(W41=[1]Datos!$B$66,Y41=[1]Datos!$B$74),[1]Datos!$F$66,IF(AND(W41=[1]Datos!$B$66,Y41=[1]Datos!$B$75),[1]Datos!$G$66,IF(AND(W41=[1]Datos!$B$66,Y41=[1]Datos!$B$76),[1]Datos!$H$66,IF(AND(W41=[1]Datos!$B$67,Y41=[1]Datos!$B$72),[1]Datos!$D$67,IF(AND(W41=[1]Datos!$B$67,Y41=[1]Datos!$B$73),[1]Datos!$E$67,IF(AND(W41=[1]Datos!$B$67,Y41=[1]Datos!$B$74),[1]Datos!$F$67,IF(AND(W41=[1]Datos!$B$67,Y41=[1]Datos!$B$75),[1]Datos!$G$67,IF(AND(W41=[1]Datos!$B$67,Y41=[1]Datos!$B$76),[1]Datos!$H$67,IF(AND(W41=[1]Datos!$B$68,Y41=[1]Datos!$B$72),[1]Datos!$D$68,IF(AND(W41=[1]Datos!$B$68,Y41=[1]Datos!$B$73),[1]Datos!$E$68,IF(AND(W41=[1]Datos!$B$68,Y41=[1]Datos!$B$74),[1]Datos!$F$68,IF(AND(W41=[1]Datos!$B$68,Y41=[1]Datos!$B$75),[1]Datos!$G$68,IF(AND(W41=[1]Datos!$B$68,Y41=[1]Datos!$B$76),[1]Datos!$H$68,IF(AND(W41=[1]Datos!$B$69,Y41=[1]Datos!$B$72),[1]Datos!$D$69,IF(AND(W41=[1]Datos!$B$69,Y41=[1]Datos!$B$73),[1]Datos!$E$69,IF(AND(W41=[1]Datos!$B$69,Y41=[1]Datos!$B$74),[1]Datos!$F$69,IF(AND(W41=[1]Datos!$B$69,Y41=[1]Datos!$B$75),[1]Datos!$G$69,IF(AND(W41=[1]Datos!$B$69,Y41=[1]Datos!$B$76),[1]Datos!$H$69,\"-\")))))))))))))))))))))))))","v":"ALTA - IMPORTANTE 9"},"Reducir (RE)"]
[null,null,null,null,"Desconocimiento de los procedimientos y beneficios  por parte de los estudiantes para vincularse a las actividades de Extensión y Proyección Social                                  ",null,"Interno",null,null,null,"No aprovechamiento de los recursos",null,null,null,"Motivar a los estudiantes a participar en las actividades de Extensión y Proyección Social ","Preventivo ","Alto - 25","Alto - 25","Alto - 25","Alto - 25",{"$f":"((IF(Q42=[1]Datos!$B$83,0,IF(Q42=[1]Datos!$B$84,5,IF(Q42=[1]Datos!$B$85,10,IF(Q42=[1]Datos!$B$86,15,IF(Q42=[1]Datos!$B$87,20,IF(Q42=[1]Datos!$B$88,25,0)))))))/100)+((IF(R42=[1]Datos!$B$83,0,IF(R42=[1]Datos!$B$84,5,IF(R42=[1]Datos!$B$85,10,IF(R42=[1]Datos!$B$86,15,IF(R42=[1]Datos!$B$87,20,IF(R42=[1]Datos!$B$88,25,0)))))))/100)+((IF(S42=[1]Datos!$B$83,0,IF(S42=[1]Datos!$B$84,5,IF(S42=[1]Datos!$B$85,10,IF(S42=[1]Datos!$B$86,15,IF(S42=[1]Datos!$B$87,20,IF(S42=[1]Datos!$B$88,25,0)))))))/100)+((IF(T42=[1]Datos!$B$83,0,IF(T42=[1]Datos!$B$84,5,IF(T42=[1]Datos!$B$85,10,IF(T42=[1]Datos!$B$86,15,IF(T42=[1]Datos!$B$87,20,IF(T42=[1]Datos!$B$88,25,0)))))))/100)","v":1}]
[null,null,null,null,"Falta de interés por parte de los estudiantes ",null,"Externo",null,null,null,"Baja calificación en los indicadores de gestión de la Universidad.\n",null,null,null,null,null,null,null,null,null,{"$f":"((IF(Q43=[1]Datos!$B$83,0,IF(Q43=[1]Datos!$B$84,5,IF(Q43=[1]Datos!$B$85,10,IF(Q43=[1]Datos!$B$86,15,IF(Q43=[1]Datos!$B$87,20,IF(Q43=[1]Datos!$B$88,25,0)))))))/100)+((IF(R43=[1]Datos!$B$83,0,IF(R43=[1]Datos!$B$84,5,IF(R43=[1]Datos!$B$85,10,IF(R43=[1]Datos!$B$86,15,IF(R43=[1]Datos!$B$87,20,IF(R43=[1]Datos!$B$88,25,0)))))))/100)+((IF(S43=[1]Datos!$B$83,0,IF(S43=[1]Datos!$B$84,5,IF(S43=[1]Datos!$B$85,10,IF(S43=[1]Datos!$B$86,15,IF(S43=[1]Datos!$B$87,20,IF(S43=[1]Datos!$B$88,25,0)))))))/100)+((IF(T43=[1]Datos!$B$83,0,IF(T43=[1]Datos!$B$84,5,IF(T43=[1]Datos!$B$85,10,IF(T43=[1]Datos!$B$86,15,IF(T43=[1]Datos!$B$87,20,IF(T43=[1]Datos!$B$88,25,0)))))))/100)","v":0}]
[null,null,null,null,null,null,null,null,null,null,null,null,null,null,null,null,null,null,null,null,{"$f":"((IF(Q44=[1]Datos!$B$83,0,IF(Q44=[1]Datos!$B$84,5,IF(Q44=[1]Datos!$B$85,10,IF(Q44=[1]Datos!$B$86,15,IF(Q44=[1]Datos!$B$87,20,IF(Q44=[1]Datos!$B$88,25,0)))))))/100)+((IF(R44=[1]Datos!$B$83,0,IF(R44=[1]Datos!$B$84,5,IF(R44=[1]Datos!$B$85,10,IF(R44=[1]Datos!$B$86,15,IF(R44=[1]Datos!$B$87,20,IF(R44=[1]Datos!$B$88,25,0)))))))/100)+((IF(S44=[1]Datos!$B$83,0,IF(S44=[1]Datos!$B$84,5,IF(S44=[1]Datos!$B$85,10,IF(S44=[1]Datos!$B$86,15,IF(S44=[1]Datos!$B$87,20,IF(S44=[1]Datos!$B$88,25,0)))))))/100)+((IF(T44=[1]Datos!$B$83,0,IF(T44=[1]Datos!$B$84,5,IF(T44=[1]Datos!$B$85,10,IF(T44=[1]Datos!$B$86,15,IF(T44=[1]Datos!$B$87,20,IF(T44=[1]Datos!$B$88,25,0)))))))/100)","v":0}]
[null,null,null,null,null,null,null,null,null,null,null,null,null,null,null,null,null,null,null,null,{"$f":"((IF(Q45=[1]Datos!$B$83,0,IF(Q45=[1]Datos!$B$84,5,IF(Q45=[1]Datos!$B$85,10,IF(Q45=[1]Datos!$B$86,15,IF(Q45=[1]Datos!$B$87,20,IF(Q45=[1]Datos!$B$88,25,0)))))))/100)+((IF(R45=[1]Datos!$B$83,0,IF(R45=[1]Datos!$B$84,5,IF(R45=[1]Datos!$B$85,10,IF(R45=[1]Datos!$B$86,15,IF(R45=[1]Datos!$B$87,20,IF(R45=[1]Datos!$B$88,25,0)))))))/100)+((IF(S45=[1]Datos!$B$83,0,IF(S45=[1]Datos!$B$84,5,IF(S45=[1]Datos!$B$85,10,IF(S45=[1]Datos!$B$86,15,IF(S45=[1]Datos!$B$87,20,IF(S45=[1]Datos!$B$88,25,0)))))))/100)+((IF(T45=[1]Datos!$B$83,0,IF(T45=[1]Datos!$B$84,5,IF(T45=[1]Datos!$B$85,10,IF(T45=[1]Datos!$B$86,15,IF(T45=[1]Datos!$B$87,20,IF(T45=[1]Datos!$B$88,25,0)))))))/100)","v":0}]
[null,null,null,null,null,null,null,null,null,null,null,null,null,null,null,null,null,null,null,null,{"$f":"((IF(Q46=[1]Datos!$B$83,0,IF(Q46=[1]Datos!$B$84,5,IF(Q46=[1]Datos!$B$85,10,IF(Q46=[1]Datos!$B$86,15,IF(Q46=[1]Datos!$B$87,20,IF(Q46=[1]Datos!$B$88,25,0)))))))/100)+((IF(R46=[1]Datos!$B$83,0,IF(R46=[1]Datos!$B$84,5,IF(R46=[1]Datos!$B$85,10,IF(R46=[1]Datos!$B$86,15,IF(R46=[1]Datos!$B$87,20,IF(R46=[1]Datos!$B$88,25,0)))))))/100)+((IF(S46=[1]Datos!$B$83,0,IF(S46=[1]Datos!$B$84,5,IF(S46=[1]Datos!$B$85,10,IF(S46=[1]Datos!$B$86,15,IF(S46=[1]Datos!$B$87,20,IF(S46=[1]Datos!$B$88,25,0)))))))/100)+((IF(T46=[1]Datos!$B$83,0,IF(T46=[1]Datos!$B$84,5,IF(T46=[1]Datos!$B$85,10,IF(T46=[1]Datos!$B$86,15,IF(T46=[1]Datos!$B$87,20,IF(T46=[1]Datos!$B$88,25,0)))))))/100)","v":0}]
[null,"Extensión y Proyección Social",null,{"$f":"IF(B47=\"\",\"-\",VLOOKUP(B47,[1]Datos!$B$4:$C$25,2,FALSE))","v":"Promover la Vinculación de la Universidad Distrital Francisco José de Caldas con su Entorno social, a través de la coordinación de los programas, planes y proyectos de Extensión y Proyección Social, en articulación a la Docencia y la Investigación."},"Exceso de trabajo asociados al proceso.\n",null,"Interno","Demoras en la revisión y firma de convenios y contratos .","Se refiere a la demora en la  revisión técnica y firma de convenios de la Unidad de extensión,  lo que afecta la ejecución de las actividades asociadas al mismo.","Operativos","No ejecución oportuna de las actividades de Extensión y Proyección Social asociadas al convenio","Probable - 4","Moderado - 3",{"$f":"IF(AND(L47=[1]Datos!$B$65,M47=[1]Datos!$B$72),[1]Datos!$D$65,IF(AND(L47=[1]Datos!$B$65,M47=[1]Datos!$B$73),[1]Datos!$E$65,IF(AND(L47=[1]Datos!$B$65,M47=[1]Datos!$B$74),[1]Datos!$F$65,IF(AND(L47=[1]Datos!$B$65,M47=[1]Datos!$B$75),[1]Datos!$G$65,IF(AND(L47=[1]Datos!$B$65,M47=[1]Datos!$B$76),[1]Datos!$H$65,IF(AND(L47=[1]Datos!$B$66,M47=[1]Datos!$B$72),[1]Datos!$D$66,IF(AND(L47=[1]Datos!$B$66,M47=[1]Datos!$B$73),[1]Datos!$E$66,IF(AND(L47=[1]Datos!$B$66,M47=[1]Datos!$B$74),[1]Datos!$F$66,IF(AND(L47=[1]Datos!$B$66,M47=[1]Datos!$B$75),[1]Datos!$G$66,IF(AND(L47=[1]Datos!$B$66,M47=[1]Datos!$B$76),[1]Datos!$H$66,IF(AND(L47=[1]Datos!$B$67,M47=[1]Datos!$B$72),[1]Datos!$D$67,IF(AND(L47=[1]Datos!$B$67,M47=[1]Datos!$B$73),[1]Datos!$E$67,IF(AND(L47=[1]Datos!$B$67,M47=[1]Datos!$B$74),[1]Datos!$F$67,IF(AND(L47=[1]Datos!$B$67,M47=[1]Datos!$B$75),[1]Datos!$G$67,IF(AND(L47=[1]Datos!$B$67,M47=[1]Datos!$B$76),[1]Datos!$H$67,IF(AND(L47=[1]Datos!$B$68,M47=[1]Datos!$B$72),[1]Datos!$D$68,IF(AND(L47=[1]Datos!$B$68,M47=[1]Datos!$B$73),[1]Datos!$E$68,IF(AND(L47=[1]Datos!$B$68,M47=[1]Datos!$B$74),[1]Datos!$F$68,IF(AND(L47=[1]Datos!$B$68,M47=[1]Datos!$B$75),[1]Datos!$G$68,IF(AND(L47=[1]Datos!$B$68,M47=[1]Datos!$B$76),[1]Datos!$H$68,IF(AND(L47=[1]Datos!$B$69,M47=[1]Datos!$B$72),[1]Datos!$D$69,IF(AND(L47=[1]Datos!$B$69,M47=[1]Datos!$B$73),[1]Datos!$E$69,IF(AND(L47=[1]Datos!$B$69,M47=[1]Datos!$B$74),[1]Datos!$F$69,IF(AND(L47=[1]Datos!$B$69,M47=[1]Datos!$B$75),[1]Datos!$G$69,IF(AND(L47=[1]Datos!$B$69,M47=[1]Datos!$B$76),[1]Datos!$H$69,\"-\")))))))))))))))))))))))))","v":"ALTA - IMPORTANTE 12"},"Reuniones para realizar seguimiento a los convenios ","Preventivo ","Medio Alto - 20","Medio Alto - 20","Medio Alto - 20","Medio - 15",{"$f":"((IF(Q47=[1]Datos!$B$83,0,IF(Q47=[1]Datos!$B$84,5,IF(Q47=[1]Datos!$B$85,10,IF(Q47=[1]Datos!$B$86,15,IF(Q47=[1]Datos!$B$87,20,IF(Q47=[1]Datos!$B$88,25,0)))))))/100)+((IF(R47=[1]Datos!$B$83,0,IF(R47=[1]Datos!$B$84,5,IF(R47=[1]Datos!$B$85,10,IF(R47=[1]Datos!$B$86,15,IF(R47=[1]Datos!$B$87,20,IF(R47=[1]Datos!$B$88,25,0)))))))/100)+((IF(S47=[1]Datos!$B$83,0,IF(S47=[1]Datos!$B$84,5,IF(S47=[1]Datos!$B$85,10,IF(S47=[1]Datos!$B$86,15,IF(S47=[1]Datos!$B$87,20,IF(S47=[1]Datos!$B$88,25,0)))))))/100)+((IF(T47=[1]Datos!$B$83,0,IF(T47=[1]Datos!$B$84,5,IF(T47=[1]Datos!$B$85,10,IF(T47=[1]Datos!$B$86,15,IF(T47=[1]Datos!$B$87,20,IF(T47=[1]Datos!$B$88,25,0)))))))/100)","v":0.75000000000000011},{"$f":"IF(ISERROR((IF(P47=[1]Datos!$B$80,[1]SGC!U47,0)+IF(P48=[1]Datos!$B$80,[1]SGC!U48,0)+IF(P49=[1]Datos!$B$80,[1]SGC!U49,0)+IF(P50=[1]Datos!$B$80,[1]SGC!U50,0)+IF(P51=[1]Datos!$B$80,[1]SGC!U51,0)+IF(P52=[1]Datos!$B$80,[1]SGC!U52,0))/(IF(P47=[1]Datos!$B$80,1,0)+IF(P48=[1]Datos!$B$80,1,0)+IF(P49=[1]Datos!$B$80,1,0)+IF(P50=[1]Datos!$B$80,1,0)+IF(P51=[1]Datos!$B$80,1,0)+IF(P52=[1]Datos!$B$80,1,0))),0,(IF(P47=[1]Datos!$B$80,[1]SGC!U47,0)+IF(P48=[1]Datos!$B$80,[1]SGC!U48,0)+IF(P49=[1]Datos!$B$80,[1]SGC!U49,0)+IF(P50=[1]Datos!$B$80,[1]SGC!U50,0)+IF(P51=[1]Datos!$B$80,[1]SGC!U51,0)+IF(P52=[1]Datos!$B$80,[1]SGC!U52,0))/(IF(P47=[1]Datos!$B$80,1,0)+IF(P48=[1]Datos!$B$80,1,0)+IF(P49=[1]Datos!$B$80,1,0)+IF(P50=[1]Datos!$B$80,1,0)+IF(P51=[1]Datos!$B$80,1,0)+IF(P52=[1]Datos!$B$80,1,0)))","v":0},{"$f":"IF(L47=\"\",\"-\",(IF(V47>0,(IF(L47=[1]Datos!$B$65,[1]Datos!$B$65,IF(AND(L47=[1]Datos!$B$66,V47>0.49),[1]Datos!$B$65,IF(AND(L47=[1]Datos!$B$67,V47>0.74),[1]Datos!$B$65,IF(AND(L47=[1]Datos!$B$67,V47<0.75,V47>0.49),[1]Datos!$B$66,IF(AND(L47=[1]Datos!$B$68,V47>0.74),[1]Datos!$B$66,IF(AND(L47=[1]Datos!$B$68,V47<0.75,V47>0.49),[1]Datos!$B$67,IF(AND(L47=[1]Datos!$B$69,V47>0.74),[1]Datos!$B$67,IF(AND(L47=[1]Datos!$B$69,V47<0.75,V47>0.49),[1]Datos!$B$68,L47))))))))),L47)))","v":"Probable - 4"},{"$f":"IF(ISERROR((IF(P47=[1]Datos!$B$79,[1]SGC!U47,0)+IF(P48=[1]Datos!$B$79,[1]SGC!U48,0)+IF(P49=[1]Datos!$B$79,[1]SGC!U49,0)+IF(P50=[1]Datos!$B$79,[1]SGC!U50,0)+IF(P51=[1]Datos!$B$79,[1]SGC!U51,0)+IF(P52=[1]Datos!$B$79,[1]SGC!U52,0))/(IF(P47=[1]Datos!$B$79,1,0)+IF(P48=[1]Datos!$B$79,1,0)+IF(P49=[1]Datos!$B$79,1,0)+IF(P50=[1]Datos!$B$79,1,0)+IF(P51=[1]Datos!$B$79,1,0)+IF(P52=[1]Datos!$B$79,1,0))),0,(IF(P47=[1]Datos!$B$79,[1]SGC!U47,0)+IF(P48=[1]Datos!$B$79,[1]SGC!U48,0)+IF(P49=[1]Datos!$B$79,[1]SGC!U49,0)+IF(P50=[1]Datos!$B$79,[1]SGC!U50,0)+IF(P51=[1]Datos!$B$79,[1]SGC!U51,0)+IF(P52=[1]Datos!$B$79,[1]SGC!U52,0))/(IF(P47=[1]Datos!$B$79,1,0)+IF(P48=[1]Datos!$B$79,1,0)+IF(P49=[1]Datos!$B$79,1,0)+IF(P50=[1]Datos!$B$79,1,0)+IF(P51=[1]Datos!$B$79,1,0)+IF(P52=[1]Datos!$B$79,1,0)))","v":0},{"$f":"IF(M47=\"\",\"-\",(IF(X47>0,(IF(M47=[1]Datos!$B$72,[1]Datos!$B$72,IF(AND(M47=[1]Datos!$B$73,X47>0.49),[1]Datos!$B$72,IF(AND(M47=[1]Datos!$B$74,X47>0.74),[1]Datos!$B$72,IF(AND(M47=[1]Datos!$B$74,X47<0.75,X47>0.49),[1]Datos!$B$73,IF(AND(M47=[1]Datos!$B$75,X47>0.74),[1]Datos!$B$73,IF(AND(M47=[1]Datos!$B$75,X47<0.75,X47>0.49),[1]Datos!$B$74,IF(AND(M47=[1]Datos!$B$76,X47>0.74),[1]Datos!$B$74,IF(AND(M47=[1]Datos!$B$76,X47<0.75,X47>0.49),[1]Datos!$B$75,M47))))))))),M47)))","v":"Moderado - 3"},{"$f":"IF(AND(W47=[1]Datos!$B$65,Y47=[1]Datos!$B$72),[1]Datos!$D$65,IF(AND(W47=[1]Datos!$B$65,Y47=[1]Datos!$B$73),[1]Datos!$E$65,IF(AND(W47=[1]Datos!$B$65,Y47=[1]Datos!$B$74),[1]Datos!$F$65,IF(AND(W47=[1]Datos!$B$65,Y47=[1]Datos!$B$75),[1]Datos!$G$65,IF(AND(W47=[1]Datos!$B$65,Y47=[1]Datos!$B$76),[1]Datos!$H$65,IF(AND(W47=[1]Datos!$B$66,Y47=[1]Datos!$B$72),[1]Datos!$D$66,IF(AND(W47=[1]Datos!$B$66,Y47=[1]Datos!$B$73),[1]Datos!$E$66,IF(AND(W47=[1]Datos!$B$66,Y47=[1]Datos!$B$74),[1]Datos!$F$66,IF(AND(W47=[1]Datos!$B$66,Y47=[1]Datos!$B$75),[1]Datos!$G$66,IF(AND(W47=[1]Datos!$B$66,Y47=[1]Datos!$B$76),[1]Datos!$H$66,IF(AND(W47=[1]Datos!$B$67,Y47=[1]Datos!$B$72),[1]Datos!$D$67,IF(AND(W47=[1]Datos!$B$67,Y47=[1]Datos!$B$73),[1]Datos!$E$67,IF(AND(W47=[1]Datos!$B$67,Y47=[1]Datos!$B$74),[1]Datos!$F$67,IF(AND(W47=[1]Datos!$B$67,Y47=[1]Datos!$B$75),[1]Datos!$G$67,IF(AND(W47=[1]Datos!$B$67,Y47=[1]Datos!$B$76),[1]Datos!$H$67,IF(AND(W47=[1]Datos!$B$68,Y47=[1]Datos!$B$72),[1]Datos!$D$68,IF(AND(W47=[1]Datos!$B$68,Y47=[1]Datos!$B$73),[1]Datos!$E$68,IF(AND(W47=[1]Datos!$B$68,Y47=[1]Datos!$B$74),[1]Datos!$F$68,IF(AND(W47=[1]Datos!$B$68,Y47=[1]Datos!$B$75),[1]Datos!$G$68,IF(AND(W47=[1]Datos!$B$68,Y47=[1]Datos!$B$76),[1]Datos!$H$68,IF(AND(W47=[1]Datos!$B$69,Y47=[1]Datos!$B$72),[1]Datos!$D$69,IF(AND(W47=[1]Datos!$B$69,Y47=[1]Datos!$B$73),[1]Datos!$E$69,IF(AND(W47=[1]Datos!$B$69,Y47=[1]Datos!$B$74),[1]Datos!$F$69,IF(AND(W47=[1]Datos!$B$69,Y47=[1]Datos!$B$75),[1]Datos!$G$69,IF(AND(W47=[1]Datos!$B$69,Y47=[1]Datos!$B$76),[1]Datos!$H$69,\"-\")))))))))))))))))))))))))","v":"ALTA - IMPORTANTE 12"},"Reducir (RE)"]
[null,null,null,null,"Procesos de comunicación internos deficientes\n",null,"Interno",null,null,null,"Pérdida en la obtención de recursos asociados al convenio o contrato",null,null,null,"Comité de Desarrollo en la cual se presentan propuestas del ILUD al IDEXUD","Preventivo ","Alto - 25","Alto - 25","Alto - 25","Alto - 25",{"$f":"((IF(Q48=[1]Datos!$B$83,0,IF(Q48=[1]Datos!$B$84,5,IF(Q48=[1]Datos!$B$85,10,IF(Q48=[1]Datos!$B$86,15,IF(Q48=[1]Datos!$B$87,20,IF(Q48=[1]Datos!$B$88,25,0)))))))/100)+((IF(R48=[1]Datos!$B$83,0,IF(R48=[1]Datos!$B$84,5,IF(R48=[1]Datos!$B$85,10,IF(R48=[1]Datos!$B$86,15,IF(R48=[1]Datos!$B$87,20,IF(R48=[1]Datos!$B$88,25,0)))))))/100)+((IF(S48=[1]Datos!$B$83,0,IF(S48=[1]Datos!$B$84,5,IF(S48=[1]Datos!$B$85,10,IF(S48=[1]Datos!$B$86,15,IF(S48=[1]Datos!$B$87,20,IF(S48=[1]Datos!$B$88,25,0)))))))/100)+((IF(T48=[1]Datos!$B$83,0,IF(T48=[1]Datos!$B$84,5,IF(T48=[1]Datos!$B$85,10,IF(T48=[1]Datos!$B$86,15,IF(T48=[1]Datos!$B$87,20,IF(T48=[1]Datos!$B$88,25,0)))))))/100)","v":1}]
[null,null,null,null,"Retrasos en la revisión jurídica del convenio",null,"Interno",null,null,null,"Perdida de Imagen Institucional",null,null,null,null,null,null,null,null,null,{"$f":"((IF(Q49=[1]Datos!$B$83,0,IF(Q49=[1]Datos!$B$84,5,IF(Q49=[1]Datos!$B$85,10,IF(Q49=[1]Datos!$B$86,15,IF(Q49=[1]Datos!$B$87,20,IF(Q49=[1]Datos!$B$88,25,0)))))))/100)+((IF(R49=[1]Datos!$B$83,0,IF(R49=[1]Datos!$B$84,5,IF(R49=[1]Datos!$B$85,10,IF(R49=[1]Datos!$B$86,15,IF(R49=[1]Datos!$B$87,20,IF(R49=[1]Datos!$B$88,25,0)))))))/100)+((IF(S49=[1]Datos!$B$83,0,IF(S49=[1]Datos!$B$84,5,IF(S49=[1]Datos!$B$85,10,IF(S49=[1]Datos!$B$86,15,IF(S49=[1]Datos!$B$87,20,IF(S49=[1]Datos!$B$88,25,0)))))))/100)+((IF(T49=[1]Datos!$B$83,0,IF(T49=[1]Datos!$B$84,5,IF(T49=[1]Datos!$B$85,10,IF(T49=[1]Datos!$B$86,15,IF(T49=[1]Datos!$B$87,20,IF(T49=[1]Datos!$B$88,25,0)))))))/100)","v":0}]
[null,null,null,null,"Demoras en procedimientos administrativos de la universidad",null,"Interno",null,null,null,null,null,null,null,null,null,null,null,null,null,{"$f":"((IF(Q50=[1]Datos!$B$83,0,IF(Q50=[1]Datos!$B$84,5,IF(Q50=[1]Datos!$B$85,10,IF(Q50=[1]Datos!$B$86,15,IF(Q50=[1]Datos!$B$87,20,IF(Q50=[1]Datos!$B$88,25,0)))))))/100)+((IF(R50=[1]Datos!$B$83,0,IF(R50=[1]Datos!$B$84,5,IF(R50=[1]Datos!$B$85,10,IF(R50=[1]Datos!$B$86,15,IF(R50=[1]Datos!$B$87,20,IF(R50=[1]Datos!$B$88,25,0)))))))/100)+((IF(S50=[1]Datos!$B$83,0,IF(S50=[1]Datos!$B$84,5,IF(S50=[1]Datos!$B$85,10,IF(S50=[1]Datos!$B$86,15,IF(S50=[1]Datos!$B$87,20,IF(S50=[1]Datos!$B$88,25,0)))))))/100)+((IF(T50=[1]Datos!$B$83,0,IF(T50=[1]Datos!$B$84,5,IF(T50=[1]Datos!$B$85,10,IF(T50=[1]Datos!$B$86,15,IF(T50=[1]Datos!$B$87,20,IF(T50=[1]Datos!$B$88,25,0)))))))/100)","v":0}]
[null,null,null,null,"No se suministra información completa u oportuna por la otra parte vinculada al contrato o convenio",null,"Externo",null,null,null,null,null,null,null,null,null,null,null,null,null,{"$f":"((IF(Q51=[1]Datos!$B$83,0,IF(Q51=[1]Datos!$B$84,5,IF(Q51=[1]Datos!$B$85,10,IF(Q51=[1]Datos!$B$86,15,IF(Q51=[1]Datos!$B$87,20,IF(Q51=[1]Datos!$B$88,25,0)))))))/100)+((IF(R51=[1]Datos!$B$83,0,IF(R51=[1]Datos!$B$84,5,IF(R51=[1]Datos!$B$85,10,IF(R51=[1]Datos!$B$86,15,IF(R51=[1]Datos!$B$87,20,IF(R51=[1]Datos!$B$88,25,0)))))))/100)+((IF(S51=[1]Datos!$B$83,0,IF(S51=[1]Datos!$B$84,5,IF(S51=[1]Datos!$B$85,10,IF(S51=[1]Datos!$B$86,15,IF(S51=[1]Datos!$B$87,20,IF(S51=[1]Datos!$B$88,25,0)))))))/100)+((IF(T51=[1]Datos!$B$83,0,IF(T51=[1]Datos!$B$84,5,IF(T51=[1]Datos!$B$85,10,IF(T51=[1]Datos!$B$86,15,IF(T51=[1]Datos!$B$87,20,IF(T51=[1]Datos!$B$88,25,0)))))))/100)","v":0}]
[null,null,null,null,null,null,null,null,null,null,null,null,null,null,null,null,null,null,null,null,{"$f":"((IF(Q52=[1]Datos!$B$83,0,IF(Q52=[1]Datos!$B$84,5,IF(Q52=[1]Datos!$B$85,10,IF(Q52=[1]Datos!$B$86,15,IF(Q52=[1]Datos!$B$87,20,IF(Q52=[1]Datos!$B$88,25,0)))))))/100)+((IF(R52=[1]Datos!$B$83,0,IF(R52=[1]Datos!$B$84,5,IF(R52=[1]Datos!$B$85,10,IF(R52=[1]Datos!$B$86,15,IF(R52=[1]Datos!$B$87,20,IF(R52=[1]Datos!$B$88,25,0)))))))/100)+((IF(S52=[1]Datos!$B$83,0,IF(S52=[1]Datos!$B$84,5,IF(S52=[1]Datos!$B$85,10,IF(S52=[1]Datos!$B$86,15,IF(S52=[1]Datos!$B$87,20,IF(S52=[1]Datos!$B$88,25,0)))))))/100)+((IF(T52=[1]Datos!$B$83,0,IF(T52=[1]Datos!$B$84,5,IF(T52=[1]Datos!$B$85,10,IF(T52=[1]Datos!$B$86,15,IF(T52=[1]Datos!$B$87,20,IF(T52=[1]Datos!$B$88,25,0)))))))/100)","v":0}]
[null,"Extensión y Proyección Social",null,{"$f":"IF(B53=\"\",\"-\",VLOOKUP(B53,[2]Datos!$B$4:$C$25,2,FALSE))","v":"Promover la Vinculación de la Universidad Distrital Francisco José de Caldas con su Entorno social, a través de la coordinación de los programas, planes y proyectos de Extensión y Proyección Social, en articulación a la Docencia y la Investigación."},"Falta de recursos económicos",null,"Externo","Incumplimiento de las actividades de investigación  proyectadas  por  el IPAZUD","No cumplimiento de los objetivos, alcances y cronogramas de los planes y programas de investigación proyectados por el IPAZUD.","De cumplimiento","Pérdida de imagen Institucional","Raro - 1","Mayor - 4",{"$f":"IF(AND(L53=[2]Datos!$B$65,M53=[2]Datos!$B$72),[2]Datos!$D$65,IF(AND(L53=[2]Datos!$B$65,M53=[2]Datos!$B$73),[2]Datos!$E$65,IF(AND(L53=[2]Datos!$B$65,M53=[2]Datos!$B$74),[2]Datos!$F$65,IF(AND(L53=[2]Datos!$B$65,M53=[2]Datos!$B$75),[2]Datos!$G$65,IF(AND(L53=[2]Datos!$B$65,M53=[2]Datos!$B$76),[2]Datos!$H$65,IF(AND(L53=[2]Datos!$B$66,M53=[2]Datos!$B$72),[2]Datos!$D$66,IF(AND(L53=[2]Datos!$B$66,M53=[2]Datos!$B$73),[2]Datos!$E$66,IF(AND(L53=[2]Datos!$B$66,M53=[2]Datos!$B$74),[2]Datos!$F$66,IF(AND(L53=[2]Datos!$B$66,M53=[2]Datos!$B$75),[2]Datos!$G$66,IF(AND(L53=[2]Datos!$B$66,M53=[2]Datos!$B$76),[2]Datos!$H$66,IF(AND(L53=[2]Datos!$B$67,M53=[2]Datos!$B$72),[2]Datos!$D$67,IF(AND(L53=[2]Datos!$B$67,M53=[2]Datos!$B$73),[2]Datos!$E$67,IF(AND(L53=[2]Datos!$B$67,M53=[2]Datos!$B$74),[2]Datos!$F$67,IF(AND(L53=[2]Datos!$B$67,M53=[2]Datos!$B$75),[2]Datos!$G$67,IF(AND(L53=[2]Datos!$B$67,M53=[2]Datos!$B$76),[2]Datos!$H$67,IF(AND(L53=[2]Datos!$B$68,M53=[2]Datos!$B$72),[2]Datos!$D$68,IF(AND(L53=[2]Datos!$B$68,M53=[2]Datos!$B$73),[2]Datos!$E$68,IF(AND(L53=[2]Datos!$B$68,M53=[2]Datos!$B$74),[2]Datos!$F$68,IF(AND(L53=[2]Datos!$B$68,M53=[2]Datos!$B$75),[2]Datos!$G$68,IF(AND(L53=[2]Datos!$B$68,M53=[2]Datos!$B$76),[2]Datos!$H$68,IF(AND(L53=[2]Datos!$B$69,M53=[2]Datos!$B$72),[2]Datos!$D$69,IF(AND(L53=[2]Datos!$B$69,M53=[2]Datos!$B$73),[2]Datos!$E$69,IF(AND(L53=[2]Datos!$B$69,M53=[2]Datos!$B$74),[2]Datos!$F$69,IF(AND(L53=[2]Datos!$B$69,M53=[2]Datos!$B$75),[2]Datos!$G$69,IF(AND(L53=[2]Datos!$B$69,M53=[2]Datos!$B$76),[2]Datos!$H$69,\"-\")))))))))))))))))))))))))","v":"ALTA-IMPORTANTE 4"},"Comité interno de seguimiento a  proyectos de investigación","Preventivo ","Alto - 25","Alto - 25","Alto - 25","Alto - 25",{"$f":"((IF(Q53=[2]Datos!$B$83,0,IF(Q53=[2]Datos!$B$84,5,IF(Q53=[2]Datos!$B$85,10,IF(Q53=[2]Datos!$B$86,15,IF(Q53=[2]Datos!$B$87,20,IF(Q53=[2]Datos!$B$88,25,0)))))))/100)+((IF(R53=[2]Datos!$B$83,0,IF(R53=[2]Datos!$B$84,5,IF(R53=[2]Datos!$B$85,10,IF(R53=[2]Datos!$B$86,15,IF(R53=[2]Datos!$B$87,20,IF(R53=[2]Datos!$B$88,25,0)))))))/100)+((IF(S53=[2]Datos!$B$83,0,IF(S53=[2]Datos!$B$84,5,IF(S53=[2]Datos!$B$85,10,IF(S53=[2]Datos!$B$86,15,IF(S53=[2]Datos!$B$87,20,IF(S53=[2]Datos!$B$88,25,0)))))))/100)+((IF(T53=[2]Datos!$B$83,0,IF(T53=[2]Datos!$B$84,5,IF(T53=[2]Datos!$B$85,10,IF(T53=[2]Datos!$B$86,15,IF(T53=[2]Datos!$B$87,20,IF(T53=[2]Datos!$B$88,25,0)))))))/100)","v":1},{"$f":"IF(ISERROR((IF(P53=[2]Datos!$B$80,U53,0)+IF(P54=[2]Datos!$B$80,U54,0)+IF(P55=[2]Datos!$B$80,U55,0)+IF(P56=[2]Datos!$B$80,U56,0)+IF(P57=[2]Datos!$B$80,U57,0)+IF(P58=[2]Datos!$B$80,U58,0))/(IF(P53=[2]Datos!$B$80,1,0)+IF(P54=[2]Datos!$B$80,1,0)+IF(P55=[2]Datos!$B$80,1,0)+IF(P56=[2]Datos!$B$80,1,0)+IF(P57=[2]Datos!$B$80,1,0)+IF(P58=[2]Datos!$B$80,1,0))),0,(IF(P53=[2]Datos!$B$80,U53,0)+IF(P54=[2]Datos!$B$80,U54,0)+IF(P55=[2]Datos!$B$80,U55,0)+IF(P56=[2]Datos!$B$80,U56,0)+IF(P57=[2]Datos!$B$80,U57,0)+IF(P58=[2]Datos!$B$80,U58,0))/(IF(P53=[2]Datos!$B$80,1,0)+IF(P54=[2]Datos!$B$80,1,0)+IF(P55=[2]Datos!$B$80,1,0)+IF(P56=[2]Datos!$B$80,1,0)+IF(P57=[2]Datos!$B$80,1,0)+IF(P58=[2]Datos!$B$80,1,0)))","v":0.95000000000000007},{"$f":"IF(L53=\"\",\"-\",(IF(V53>0,(IF(L53=[2]Datos!$B$65,[2]Datos!$B$65,IF(AND(L53=[2]Datos!$B$66,V53>0.49),[2]Datos!$B$65,IF(AND(L53=[2]Datos!$B$67,V53>0.74),[2]Datos!$B$65,IF(AND(L53=[2]Datos!$B$67,V53<0.75,V53>0.49),[2]Datos!$B$66,IF(AND(L53=[2]Datos!$B$68,V53>0.74),[2]Datos!$B$66,IF(AND(L53=[2]Datos!$B$68,V53<0.75,V53>0.49),[2]Datos!$B$67,IF(AND(L53=[2]Datos!$B$69,V53>0.74),[2]Datos!$B$67,IF(AND(L53=[2]Datos!$B$69,V53<0.75,V53>0.49),[2]Datos!$B$68,L53))))))))),L53)))","v":"Raro - 1"},{"$f":"IF(ISERROR((IF(P53=[2]Datos!$B$79,U53,0)+IF(P54=[2]Datos!$B$79,U54,0)+IF(P55=[2]Datos!$B$79,U55,0)+IF(P56=[2]Datos!$B$79,U56,0)+IF(P57=[2]Datos!$B$79,U57,0)+IF(P58=[2]Datos!$B$79,U58,0))/(IF(P53=[2]Datos!$B$79,1,0)+IF(P54=[2]Datos!$B$79,1,0)+IF(P55=[2]Datos!$B$79,1,0)+IF(P56=[2]Datos!$B$79,1,0)+IF(P57=[2]Datos!$B$79,1,0)+IF(P58=[2]Datos!$B$79,1,0))),0,(IF(P53=[2]Datos!$B$79,U53,0)+IF(P54=[2]Datos!$B$79,U54,0)+IF(P55=[2]Datos!$B$79,U55,0)+IF(P56=[2]Datos!$B$79,U56,0)+IF(P57=[2]Datos!$B$79,U57,0)+IF(P58=[2]Datos!$B$79,U58,0))/(IF(P53=[2]Datos!$B$79,1,0)+IF(P54=[2]Datos!$B$79,1,0)+IF(P55=[2]Datos!$B$79,1,0)+IF(P56=[2]Datos!$B$79,1,0)+IF(P57=[2]Datos!$B$79,1,0)+IF(P58=[2]Datos!$B$79,1,0)))","v":0},{"$f":"IF(M53=\"\",\"-\",(IF(X53>0,(IF(M53=[2]Datos!$B$72,[2]Datos!$B$72,IF(AND(M53=[2]Datos!$B$73,X53>0.49),[2]Datos!$B$72,IF(AND(M53=[2]Datos!$B$74,X53>0.74),[2]Datos!$B$72,IF(AND(M53=[2]Datos!$B$74,X53<0.75,X53>0.49),[2]Datos!$B$73,IF(AND(M53=[2]Datos!$B$75,X53>0.74),[2]Datos!$B$73,IF(AND(M53=[2]Datos!$B$75,X53<0.75,X53>0.49),[2]Datos!$B$74,IF(AND(M53=[2]Datos!$B$76,X53>0.74),[2]Datos!$B$74,IF(AND(M53=[2]Datos!$B$76,X53<0.75,X53>0.49),[2]Datos!$B$75,M53))))))))),M53)))","v":"Mayor - 4"},{"$f":"IF(AND(W53=[2]Datos!$B$65,Y53=[2]Datos!$B$72),[2]Datos!$D$65,IF(AND(W53=[2]Datos!$B$65,Y53=[2]Datos!$B$73),[2]Datos!$E$65,IF(AND(W53=[2]Datos!$B$65,Y53=[2]Datos!$B$74),[2]Datos!$F$65,IF(AND(W53=[2]Datos!$B$65,Y53=[2]Datos!$B$75),[2]Datos!$G$65,IF(AND(W53=[2]Datos!$B$65,Y53=[2]Datos!$B$76),[2]Datos!$H$65,IF(AND(W53=[2]Datos!$B$66,Y53=[2]Datos!$B$72),[2]Datos!$D$66,IF(AND(W53=[2]Datos!$B$66,Y53=[2]Datos!$B$73),[2]Datos!$E$66,IF(AND(W53=[2]Datos!$B$66,Y53=[2]Datos!$B$74),[2]Datos!$F$66,IF(AND(W53=[2]Datos!$B$66,Y53=[2]Datos!$B$75),[2]Datos!$G$66,IF(AND(W53=[2]Datos!$B$66,Y53=[2]Datos!$B$76),[2]Datos!$H$66,IF(AND(W53=[2]Datos!$B$67,Y53=[2]Datos!$B$72),[2]Datos!$D$67,IF(AND(W53=[2]Datos!$B$67,Y53=[2]Datos!$B$73),[2]Datos!$E$67,IF(AND(W53=[2]Datos!$B$67,Y53=[2]Datos!$B$74),[2]Datos!$F$67,IF(AND(W53=[2]Datos!$B$67,Y53=[2]Datos!$B$75),[2]Datos!$G$67,IF(AND(W53=[2]Datos!$B$67,Y53=[2]Datos!$B$76),[2]Datos!$H$67,IF(AND(W53=[2]Datos!$B$68,Y53=[2]Datos!$B$72),[2]Datos!$D$68,IF(AND(W53=[2]Datos!$B$68,Y53=[2]Datos!$B$73),[2]Datos!$E$68,IF(AND(W53=[2]Datos!$B$68,Y53=[2]Datos!$B$74),[2]Datos!$F$68,IF(AND(W53=[2]Datos!$B$68,Y53=[2]Datos!$B$75),[2]Datos!$G$68,IF(AND(W53=[2]Datos!$B$68,Y53=[2]Datos!$B$76),[2]Datos!$H$68,IF(AND(W53=[2]Datos!$B$69,Y53=[2]Datos!$B$72),[2]Datos!$D$69,IF(AND(W53=[2]Datos!$B$69,Y53=[2]Datos!$B$73),[2]Datos!$E$69,IF(AND(W53=[2]Datos!$B$69,Y53=[2]Datos!$B$74),[2]Datos!$F$69,IF(AND(W53=[2]Datos!$B$69,Y53=[2]Datos!$B$75),[2]Datos!$G$69,IF(AND(W53=[2]Datos!$B$69,Y53=[2]Datos!$B$76),[2]Datos!$H$69,\"-\")))))))))))))))))))))))))","v":"ALTA-IMPORTANTE 4"},"Reducir (RE)"]
[null,null,null,null,"Falta de personal de planta o de disponibilidad de talento humano calificado",null,"Externo",null,null,null,"Bajo impacto de la Universidad en el entorno",null,null,null,"Seguimiento a proyectos de investigación por parte del CIDC","Preventivo ","Alto - 25","Medio Alto - 20","Medio Alto - 20","Medio Alto - 20",{"$f":"((IF(Q54=[2]Datos!$B$83,0,IF(Q54=[2]Datos!$B$84,5,IF(Q54=[2]Datos!$B$85,10,IF(Q54=[2]Datos!$B$86,15,IF(Q54=[2]Datos!$B$87,20,IF(Q54=[2]Datos!$B$88,25,0)))))))/100)+((IF(R54=[2]Datos!$B$83,0,IF(R54=[2]Datos!$B$84,5,IF(R54=[2]Datos!$B$85,10,IF(R54=[2]Datos!$B$86,15,IF(R54=[2]Datos!$B$87,20,IF(R54=[2]Datos!$B$88,25,0)))))))/100)+((IF(S54=[2]Datos!$B$83,0,IF(S54=[2]Datos!$B$84,5,IF(S54=[2]Datos!$B$85,10,IF(S54=[2]Datos!$B$86,15,IF(S54=[2]Datos!$B$87,20,IF(S54=[2]Datos!$B$88,25,0)))))))/100)+((IF(T54=[2]Datos!$B$83,0,IF(T54=[2]Datos!$B$84,5,IF(T54=[2]Datos!$B$85,10,IF(T54=[2]Datos!$B$86,15,IF(T54=[2]Datos!$B$87,20,IF(T54=[2]Datos!$B$88,25,0)))))))/100)","v":0.85000000000000009}]
[null,null,null,null,"Ausencia de alianzas estratégicas.",null,"Interno",null,null,null,"Incumplimiento de la misión de la Universidad ",null,null,null,"Informes parciales de avance","Preventivo ","Alto - 25","Alto - 25","Alto - 25","Alto - 25",{"$f":"((IF(Q55=[2]Datos!$B$83,0,IF(Q55=[2]Datos!$B$84,5,IF(Q55=[2]Datos!$B$85,10,IF(Q55=[2]Datos!$B$86,15,IF(Q55=[2]Datos!$B$87,20,IF(Q55=[2]Datos!$B$88,25,0)))))))/100)+((IF(R55=[2]Datos!$B$83,0,IF(R55=[2]Datos!$B$84,5,IF(R55=[2]Datos!$B$85,10,IF(R55=[2]Datos!$B$86,15,IF(R55=[2]Datos!$B$87,20,IF(R55=[2]Datos!$B$88,25,0)))))))/100)+((IF(S55=[2]Datos!$B$83,0,IF(S55=[2]Datos!$B$84,5,IF(S55=[2]Datos!$B$85,10,IF(S55=[2]Datos!$B$86,15,IF(S55=[2]Datos!$B$87,20,IF(S55=[2]Datos!$B$88,25,0)))))))/100)+((IF(T55=[2]Datos!$B$83,0,IF(T55=[2]Datos!$B$84,5,IF(T55=[2]Datos!$B$85,10,IF(T55=[2]Datos!$B$86,15,IF(T55=[2]Datos!$B$87,20,IF(T55=[2]Datos!$B$88,25,0)))))))/100)","v":1}]
[null,null,null,null,"Falta de seguimiento y control en el   desarrollo de los proyecto.",null,"Interno",null,null,null,"Baja calificación en los indicadores de gestión",null,null,null,null,null,null,null,null,null,{"$f":"((IF(Q56=[2]Datos!$B$83,0,IF(Q56=[2]Datos!$B$84,5,IF(Q56=[2]Datos!$B$85,10,IF(Q56=[2]Datos!$B$86,15,IF(Q56=[2]Datos!$B$87,20,IF(Q56=[2]Datos!$B$88,25,0)))))))/100)+((IF(R56=[2]Datos!$B$83,0,IF(R56=[2]Datos!$B$84,5,IF(R56=[2]Datos!$B$85,10,IF(R56=[2]Datos!$B$86,15,IF(R56=[2]Datos!$B$87,20,IF(R56=[2]Datos!$B$88,25,0)))))))/100)+((IF(S56=[2]Datos!$B$83,0,IF(S56=[2]Datos!$B$84,5,IF(S56=[2]Datos!$B$85,10,IF(S56=[2]Datos!$B$86,15,IF(S56=[2]Datos!$B$87,20,IF(S56=[2]Datos!$B$88,25,0)))))))/100)+((IF(T56=[2]Datos!$B$83,0,IF(T56=[2]Datos!$B$84,5,IF(T56=[2]Datos!$B$85,10,IF(T56=[2]Datos!$B$86,15,IF(T56=[2]Datos!$B$87,20,IF(T56=[2]Datos!$B$88,25,0)))))))/100)","v":0}]
[null,null,null,null,null,null,null,null,null,null,"Pérdida de credibilidad ante la comunidad.\n",null,null,null,null,null,null,null,null,null,{"$f":"((IF(Q57=[2]Datos!$B$83,0,IF(Q57=[2]Datos!$B$84,5,IF(Q57=[2]Datos!$B$85,10,IF(Q57=[2]Datos!$B$86,15,IF(Q57=[2]Datos!$B$87,20,IF(Q57=[2]Datos!$B$88,25,0)))))))/100)+((IF(R57=[2]Datos!$B$83,0,IF(R57=[2]Datos!$B$84,5,IF(R57=[2]Datos!$B$85,10,IF(R57=[2]Datos!$B$86,15,IF(R57=[2]Datos!$B$87,20,IF(R57=[2]Datos!$B$88,25,0)))))))/100)+((IF(S57=[2]Datos!$B$83,0,IF(S57=[2]Datos!$B$84,5,IF(S57=[2]Datos!$B$85,10,IF(S57=[2]Datos!$B$86,15,IF(S57=[2]Datos!$B$87,20,IF(S57=[2]Datos!$B$88,25,0)))))))/100)+((IF(T57=[2]Datos!$B$83,0,IF(T57=[2]Datos!$B$84,5,IF(T57=[2]Datos!$B$85,10,IF(T57=[2]Datos!$B$86,15,IF(T57=[2]Datos!$B$87,20,IF(T57=[2]Datos!$B$88,25,0)))))))/100)","v":0}]
[null,null,null,null,null,null,null,null,null,null,null,null,null,null,null,null,null,null,null,null,{"$f":"((IF(Q58=[2]Datos!$B$83,0,IF(Q58=[2]Datos!$B$84,5,IF(Q58=[2]Datos!$B$85,10,IF(Q58=[2]Datos!$B$86,15,IF(Q58=[2]Datos!$B$87,20,IF(Q58=[2]Datos!$B$88,25,0)))))))/100)+((IF(R58=[2]Datos!$B$83,0,IF(R58=[2]Datos!$B$84,5,IF(R58=[2]Datos!$B$85,10,IF(R58=[2]Datos!$B$86,15,IF(R58=[2]Datos!$B$87,20,IF(R58=[2]Datos!$B$88,25,0)))))))/100)+((IF(S58=[2]Datos!$B$83,0,IF(S58=[2]Datos!$B$84,5,IF(S58=[2]Datos!$B$85,10,IF(S58=[2]Datos!$B$86,15,IF(S58=[2]Datos!$B$87,20,IF(S58=[2]Datos!$B$88,25,0)))))))/100)+((IF(T58=[2]Datos!$B$83,0,IF(T58=[2]Datos!$B$84,5,IF(T58=[2]Datos!$B$85,10,IF(T58=[2]Datos!$B$86,15,IF(T58=[2]Datos!$B$87,20,IF(T58=[2]Datos!$B$88,25,0)))))))/100)","v":0}]
[null,"Extensión y Proyección Social",null,{"$f":"IF(B59=\"\",\"-\",VLOOKUP(B59,[2]Datos!$B$4:$C$25,2,FALSE))","v":"Promover la Vinculación de la Universidad Distrital Francisco José de Caldas con su Entorno social, a través de la coordinación de los programas, planes y proyectos de Extensión y Proyección Social, en articulación a la Docencia y la Investigación."},"Limitado presupuesto para desarrollar los eventos",null,"Externo","Baja creación y participación en eventos de  formación y programas de gestión social y cultural. ","Incumplimiento de los eventos, seminarios, conferencias y espacios de formación organizados por el IPAZUD en el Plan anual de Acción.","De cumplimiento",null,"Raro - 1","Mayor - 4",{"$f":"IF(AND(L59=[2]Datos!$B$65,M59=[2]Datos!$B$72),[2]Datos!$D$65,IF(AND(L59=[2]Datos!$B$65,M59=[2]Datos!$B$73),[2]Datos!$E$65,IF(AND(L59=[2]Datos!$B$65,M59=[2]Datos!$B$74),[2]Datos!$F$65,IF(AND(L59=[2]Datos!$B$65,M59=[2]Datos!$B$75),[2]Datos!$G$65,IF(AND(L59=[2]Datos!$B$65,M59=[2]Datos!$B$76),[2]Datos!$H$65,IF(AND(L59=[2]Datos!$B$66,M59=[2]Datos!$B$72),[2]Datos!$D$66,IF(AND(L59=[2]Datos!$B$66,M59=[2]Datos!$B$73),[2]Datos!$E$66,IF(AND(L59=[2]Datos!$B$66,M59=[2]Datos!$B$74),[2]Datos!$F$66,IF(AND(L59=[2]Datos!$B$66,M59=[2]Datos!$B$75),[2]Datos!$G$66,IF(AND(L59=[2]Datos!$B$66,M59=[2]Datos!$B$76),[2]Datos!$H$66,IF(AND(L59=[2]Datos!$B$67,M59=[2]Datos!$B$72),[2]Datos!$D$67,IF(AND(L59=[2]Datos!$B$67,M59=[2]Datos!$B$73),[2]Datos!$E$67,IF(AND(L59=[2]Datos!$B$67,M59=[2]Datos!$B$74),[2]Datos!$F$67,IF(AND(L59=[2]Datos!$B$67,M59=[2]Datos!$B$75),[2]Datos!$G$67,IF(AND(L59=[2]Datos!$B$67,M59=[2]Datos!$B$76),[2]Datos!$H$67,IF(AND(L59=[2]Datos!$B$68,M59=[2]Datos!$B$72),[2]Datos!$D$68,IF(AND(L59=[2]Datos!$B$68,M59=[2]Datos!$B$73),[2]Datos!$E$68,IF(AND(L59=[2]Datos!$B$68,M59=[2]Datos!$B$74),[2]Datos!$F$68,IF(AND(L59=[2]Datos!$B$68,M59=[2]Datos!$B$75),[2]Datos!$G$68,IF(AND(L59=[2]Datos!$B$68,M59=[2]Datos!$B$76),[2]Datos!$H$68,IF(AND(L59=[2]Datos!$B$69,M59=[2]Datos!$B$72),[2]Datos!$D$69,IF(AND(L59=[2]Datos!$B$69,M59=[2]Datos!$B$73),[2]Datos!$E$69,IF(AND(L59=[2]Datos!$B$69,M59=[2]Datos!$B$74),[2]Datos!$F$69,IF(AND(L59=[2]Datos!$B$69,M59=[2]Datos!$B$75),[2]Datos!$G$69,IF(AND(L59=[2]Datos!$B$69,M59=[2]Datos!$B$76),[2]Datos!$H$69,\"-\")))))))))))))))))))))))))","v":"ALTA-IMPORTANTE 4"},"Búsqueda de alianzas con otras entidades para realizar los eventos","Preventivo ","Alto - 25","Alto - 25","Alto - 25","Alto - 25",{"$f":"((IF(Q59=[2]Datos!$B$83,0,IF(Q59=[2]Datos!$B$84,5,IF(Q59=[2]Datos!$B$85,10,IF(Q59=[2]Datos!$B$86,15,IF(Q59=[2]Datos!$B$87,20,IF(Q59=[2]Datos!$B$88,25,0)))))))/100)+((IF(R59=[2]Datos!$B$83,0,IF(R59=[2]Datos!$B$84,5,IF(R59=[2]Datos!$B$85,10,IF(R59=[2]Datos!$B$86,15,IF(R59=[2]Datos!$B$87,20,IF(R59=[2]Datos!$B$88,25,0)))))))/100)+((IF(S59=[2]Datos!$B$83,0,IF(S59=[2]Datos!$B$84,5,IF(S59=[2]Datos!$B$85,10,IF(S59=[2]Datos!$B$86,15,IF(S59=[2]Datos!$B$87,20,IF(S59=[2]Datos!$B$88,25,0)))))))/100)+((IF(T59=[2]Datos!$B$83,0,IF(T59=[2]Datos!$B$84,5,IF(T59=[2]Datos!$B$85,10,IF(T59=[2]Datos!$B$86,15,IF(T59=[2]Datos!$B$87,20,IF(T59=[2]Datos!$B$88,25,0)))))))/100)","v":1},{"$f":"IF(ISERROR((IF(P59=[2]Datos!$B$80,U59,0)+IF(P60=[2]Datos!$B$80,U60,0)+IF(P61=[2]Datos!$B$80,U61,0)+IF(P62=[2]Datos!$B$80,U62,0)+IF(P63=[2]Datos!$B$80,U63,0)+IF(P64=[2]Datos!$B$80,U64,0))/(IF(P59=[2]Datos!$B$80,1,0)+IF(P60=[2]Datos!$B$80,1,0)+IF(P61=[2]Datos!$B$80,1,0)+IF(P62=[2]Datos!$B$80,1,0)+IF(P63=[2]Datos!$B$80,1,0)+IF(P64=[2]Datos!$B$80,1,0))),0,(IF(P59=[2]Datos!$B$80,U59,0)+IF(P60=[2]Datos!$B$80,U60,0)+IF(P61=[2]Datos!$B$80,U61,0)+IF(P62=[2]Datos!$B$80,U62,0)+IF(P63=[2]Datos!$B$80,U63,0)+IF(P64=[2]Datos!$B$80,U64,0))/(IF(P59=[2]Datos!$B$80,1,0)+IF(P60=[2]Datos!$B$80,1,0)+IF(P61=[2]Datos!$B$80,1,0)+IF(P62=[2]Datos!$B$80,1,0)+IF(P63=[2]Datos!$B$80,1,0)+IF(P64=[2]Datos!$B$80,1,0)))","v":0.95},{"$f":"IF(L59=\"\",\"-\",(IF(V59>0,(IF(L59=[2]Datos!$B$65,[2]Datos!$B$65,IF(AND(L59=[2]Datos!$B$66,V59>0.49),[2]Datos!$B$65,IF(AND(L59=[2]Datos!$B$67,V59>0.74),[2]Datos!$B$65,IF(AND(L59=[2]Datos!$B$67,V59<0.75,V59>0.49),[2]Datos!$B$66,IF(AND(L59=[2]Datos!$B$68,V59>0.74),[2]Datos!$B$66,IF(AND(L59=[2]Datos!$B$68,V59<0.75,V59>0.49),[2]Datos!$B$67,IF(AND(L59=[2]Datos!$B$69,V59>0.74),[2]Datos!$B$67,IF(AND(L59=[2]Datos!$B$69,V59<0.75,V59>0.49),[2]Datos!$B$68,L59))))))))),L59)))","v":"Raro - 1"},{"$f":"IF(ISERROR((IF(P59=[2]Datos!$B$79,U59,0)+IF(P60=[2]Datos!$B$79,U60,0)+IF(P61=[2]Datos!$B$79,U61,0)+IF(P62=[2]Datos!$B$79,U62,0)+IF(P63=[2]Datos!$B$79,U63,0)+IF(P64=[2]Datos!$B$79,U64,0))/(IF(P59=[2]Datos!$B$79,1,0)+IF(P60=[2]Datos!$B$79,1,0)+IF(P61=[2]Datos!$B$79,1,0)+IF(P62=[2]Datos!$B$79,1,0)+IF(P63=[2]Datos!$B$79,1,0)+IF(P64=[2]Datos!$B$79,1,0))),0,(IF(P59=[2]Datos!$B$79,U59,0)+IF(P60=[2]Datos!$B$79,U60,0)+IF(P61=[2]Datos!$B$79,U61,0)+IF(P62=[2]Datos!$B$79,U62,0)+IF(P63=[2]Datos!$B$79,U63,0)+IF(P64=[2]Datos!$B$79,U64,0))/(IF(P59=[2]Datos!$B$79,1,0)+IF(P60=[2]Datos!$B$79,1,0)+IF(P61=[2]Datos!$B$79,1,0)+IF(P62=[2]Datos!$B$79,1,0)+IF(P63=[2]Datos!$B$79,1,0)+IF(P64=[2]Datos!$B$79,1,0)))","v":0},{"$f":"IF(M59=\"\",\"-\",(IF(X59>0,(IF(M59=[2]Datos!$B$72,[2]Datos!$B$72,IF(AND(M59=[2]Datos!$B$73,X59>0.49),[2]Datos!$B$72,IF(AND(M59=[2]Datos!$B$74,X59>0.74),[2]Datos!$B$72,IF(AND(M59=[2]Datos!$B$74,X59<0.75,X59>0.49),[2]Datos!$B$73,IF(AND(M59=[2]Datos!$B$75,X59>0.74),[2]Datos!$B$73,IF(AND(M59=[2]Datos!$B$75,X59<0.75,X59>0.49),[2]Datos!$B$74,IF(AND(M59=[2]Datos!$B$76,X59>0.74),[2]Datos!$B$74,IF(AND(M59=[2]Datos!$B$76,X59<0.75,X59>0.49),[2]Datos!$B$75,M59))))))))),M59)))","v":"Mayor - 4"},{"$f":"IF(AND(W59=[2]Datos!$B$65,Y59=[2]Datos!$B$72),[2]Datos!$D$65,IF(AND(W59=[2]Datos!$B$65,Y59=[2]Datos!$B$73),[2]Datos!$E$65,IF(AND(W59=[2]Datos!$B$65,Y59=[2]Datos!$B$74),[2]Datos!$F$65,IF(AND(W59=[2]Datos!$B$65,Y59=[2]Datos!$B$75),[2]Datos!$G$65,IF(AND(W59=[2]Datos!$B$65,Y59=[2]Datos!$B$76),[2]Datos!$H$65,IF(AND(W59=[2]Datos!$B$66,Y59=[2]Datos!$B$72),[2]Datos!$D$66,IF(AND(W59=[2]Datos!$B$66,Y59=[2]Datos!$B$73),[2]Datos!$E$66,IF(AND(W59=[2]Datos!$B$66,Y59=[2]Datos!$B$74),[2]Datos!$F$66,IF(AND(W59=[2]Datos!$B$66,Y59=[2]Datos!$B$75),[2]Datos!$G$66,IF(AND(W59=[2]Datos!$B$66,Y59=[2]Datos!$B$76),[2]Datos!$H$66,IF(AND(W59=[2]Datos!$B$67,Y59=[2]Datos!$B$72),[2]Datos!$D$67,IF(AND(W59=[2]Datos!$B$67,Y59=[2]Datos!$B$73),[2]Datos!$E$67,IF(AND(W59=[2]Datos!$B$67,Y59=[2]Datos!$B$74),[2]Datos!$F$67,IF(AND(W59=[2]Datos!$B$67,Y59=[2]Datos!$B$75),[2]Datos!$G$67,IF(AND(W59=[2]Datos!$B$67,Y59=[2]Datos!$B$76),[2]Datos!$H$67,IF(AND(W59=[2]Datos!$B$68,Y59=[2]Datos!$B$72),[2]Datos!$D$68,IF(AND(W59=[2]Datos!$B$68,Y59=[2]Datos!$B$73),[2]Datos!$E$68,IF(AND(W59=[2]Datos!$B$68,Y59=[2]Datos!$B$74),[2]Datos!$F$68,IF(AND(W59=[2]Datos!$B$68,Y59=[2]Datos!$B$75),[2]Datos!$G$68,IF(AND(W59=[2]Datos!$B$68,Y59=[2]Datos!$B$76),[2]Datos!$H$68,IF(AND(W59=[2]Datos!$B$69,Y59=[2]Datos!$B$72),[2]Datos!$D$69,IF(AND(W59=[2]Datos!$B$69,Y59=[2]Datos!$B$73),[2]Datos!$E$69,IF(AND(W59=[2]Datos!$B$69,Y59=[2]Datos!$B$74),[2]Datos!$F$69,IF(AND(W59=[2]Datos!$B$69,Y59=[2]Datos!$B$75),[2]Datos!$G$69,IF(AND(W59=[2]Datos!$B$69,Y59=[2]Datos!$B$76),[2]Datos!$H$69,\"-\")))))))))))))))))))))))))","v":"ALTA-IMPORTANTE 4"},"Reducir (RE)"]
[null,null,null,null,"Personal de planta  insuficiente ",null,"Externo",null,null,null,"Bajo impacto de la Universidad en el entorno",null,null,null,"Planeación de actividades y cronogramas del evento","Preventivo ","Alto - 25","Medio Alto - 20","Medio Alto - 20","Alto - 25",{"$f":"((IF(Q60=[2]Datos!$B$83,0,IF(Q60=[2]Datos!$B$84,5,IF(Q60=[2]Datos!$B$85,10,IF(Q60=[2]Datos!$B$86,15,IF(Q60=[2]Datos!$B$87,20,IF(Q60=[2]Datos!$B$88,25,0)))))))/100)+((IF(R60=[2]Datos!$B$83,0,IF(R60=[2]Datos!$B$84,5,IF(R60=[2]Datos!$B$85,10,IF(R60=[2]Datos!$B$86,15,IF(R60=[2]Datos!$B$87,20,IF(R60=[2]Datos!$B$88,25,0)))))))/100)+((IF(S60=[2]Datos!$B$83,0,IF(S60=[2]Datos!$B$84,5,IF(S60=[2]Datos!$B$85,10,IF(S60=[2]Datos!$B$86,15,IF(S60=[2]Datos!$B$87,20,IF(S60=[2]Datos!$B$88,25,0)))))))/100)+((IF(T60=[2]Datos!$B$83,0,IF(T60=[2]Datos!$B$84,5,IF(T60=[2]Datos!$B$85,10,IF(T60=[2]Datos!$B$86,15,IF(T60=[2]Datos!$B$87,20,IF(T60=[2]Datos!$B$88,25,0)))))))/100)","v":0.9}]
[null,null,null,null,"Falta de prepuesto para contratación ",null,"Externo",null,null,null,"Incumplimiento en la totalidad de los objetivos planteados por el IPAZUD",null,null,null,null,null,null,null,null,null,{"$f":"((IF(Q61=[2]Datos!$B$83,0,IF(Q61=[2]Datos!$B$84,5,IF(Q61=[2]Datos!$B$85,10,IF(Q61=[2]Datos!$B$86,15,IF(Q61=[2]Datos!$B$87,20,IF(Q61=[2]Datos!$B$88,25,0)))))))/100)+((IF(R61=[2]Datos!$B$83,0,IF(R61=[2]Datos!$B$84,5,IF(R61=[2]Datos!$B$85,10,IF(R61=[2]Datos!$B$86,15,IF(R61=[2]Datos!$B$87,20,IF(R61=[2]Datos!$B$88,25,0)))))))/100)+((IF(S61=[2]Datos!$B$83,0,IF(S61=[2]Datos!$B$84,5,IF(S61=[2]Datos!$B$85,10,IF(S61=[2]Datos!$B$86,15,IF(S61=[2]Datos!$B$87,20,IF(S61=[2]Datos!$B$88,25,0)))))))/100)+((IF(T61=[2]Datos!$B$83,0,IF(T61=[2]Datos!$B$84,5,IF(T61=[2]Datos!$B$85,10,IF(T61=[2]Datos!$B$86,15,IF(T61=[2]Datos!$B$87,20,IF(T61=[2]Datos!$B$88,25,0)))))))/100)","v":0}]
[null,null,null,null,"Falta de infraestructura física para realizar los eventos",null,"Externo",null,null,null,null,null,null,null,null,null,null,null,null,null,{"$f":"((IF(Q62=[2]Datos!$B$83,0,IF(Q62=[2]Datos!$B$84,5,IF(Q62=[2]Datos!$B$85,10,IF(Q62=[2]Datos!$B$86,15,IF(Q62=[2]Datos!$B$87,20,IF(Q62=[2]Datos!$B$88,25,0)))))))/100)+((IF(R62=[2]Datos!$B$83,0,IF(R62=[2]Datos!$B$84,5,IF(R62=[2]Datos!$B$85,10,IF(R62=[2]Datos!$B$86,15,IF(R62=[2]Datos!$B$87,20,IF(R62=[2]Datos!$B$88,25,0)))))))/100)+((IF(S62=[2]Datos!$B$83,0,IF(S62=[2]Datos!$B$84,5,IF(S62=[2]Datos!$B$85,10,IF(S62=[2]Datos!$B$86,15,IF(S62=[2]Datos!$B$87,20,IF(S62=[2]Datos!$B$88,25,0)))))))/100)+((IF(T62=[2]Datos!$B$83,0,IF(T62=[2]Datos!$B$84,5,IF(T62=[2]Datos!$B$85,10,IF(T62=[2]Datos!$B$86,15,IF(T62=[2]Datos!$B$87,20,IF(T62=[2]Datos!$B$88,25,0)))))))/100)","v":0}]
[null,null,null,null,null,null,null,null,null,null,null,null,null,null,null,null,null,null,null,null,{"$f":"((IF(Q63=[2]Datos!$B$83,0,IF(Q63=[2]Datos!$B$84,5,IF(Q63=[2]Datos!$B$85,10,IF(Q63=[2]Datos!$B$86,15,IF(Q63=[2]Datos!$B$87,20,IF(Q63=[2]Datos!$B$88,25,0)))))))/100)+((IF(R63=[2]Datos!$B$83,0,IF(R63=[2]Datos!$B$84,5,IF(R63=[2]Datos!$B$85,10,IF(R63=[2]Datos!$B$86,15,IF(R63=[2]Datos!$B$87,20,IF(R63=[2]Datos!$B$88,25,0)))))))/100)+((IF(S63=[2]Datos!$B$83,0,IF(S63=[2]Datos!$B$84,5,IF(S63=[2]Datos!$B$85,10,IF(S63=[2]Datos!$B$86,15,IF(S63=[2]Datos!$B$87,20,IF(S63=[2]Datos!$B$88,25,0)))))))/100)+((IF(T63=[2]Datos!$B$83,0,IF(T63=[2]Datos!$B$84,5,IF(T63=[2]Datos!$B$85,10,IF(T63=[2]Datos!$B$86,15,IF(T63=[2]Datos!$B$87,20,IF(T63=[2]Datos!$B$88,25,0)))))))/100)","v":0}]
[null,null,null,null,null,null,null,null,null,null,null,null,null,null,null,null,null,null,null,null,{"$f":"((IF(Q64=[2]Datos!$B$83,0,IF(Q64=[2]Datos!$B$84,5,IF(Q64=[2]Datos!$B$85,10,IF(Q64=[2]Datos!$B$86,15,IF(Q64=[2]Datos!$B$87,20,IF(Q64=[2]Datos!$B$88,25,0)))))))/100)+((IF(R64=[2]Datos!$B$83,0,IF(R64=[2]Datos!$B$84,5,IF(R64=[2]Datos!$B$85,10,IF(R64=[2]Datos!$B$86,15,IF(R64=[2]Datos!$B$87,20,IF(R64=[2]Datos!$B$88,25,0)))))))/100)+((IF(S64=[2]Datos!$B$83,0,IF(S64=[2]Datos!$B$84,5,IF(S64=[2]Datos!$B$85,10,IF(S64=[2]Datos!$B$86,15,IF(S64=[2]Datos!$B$87,20,IF(S64=[2]Datos!$B$88,25,0)))))))/100)+((IF(T64=[2]Datos!$B$83,0,IF(T64=[2]Datos!$B$84,5,IF(T64=[2]Datos!$B$85,10,IF(T64=[2]Datos!$B$86,15,IF(T64=[2]Datos!$B$87,20,IF(T64=[2]Datos!$B$88,25,0)))))))/100)","v":0}]
[null,"Extensión y Proyección Social",null,{"$f":"IF(B65=\"\",\"-\",VLOOKUP(B65,[2]Datos!$B$4:$C$25,2,FALSE))","v":"Promover la Vinculación de la Universidad Distrital Francisco José de Caldas con su Entorno social, a través de la coordinación de los programas, planes y proyectos de Extensión y Proyección Social, en articulación a la Docencia y la Investigación."},"Poca divulgación de las actividades",null,"Interno","Poca participación de los estudiantes de la Universidad Distrital Francisco José de Caldas en las actividades de extensión y proyección social organizadas por el IPAZUD.","Baja  participación  de los estudiantes de la Universidad Distrital Francisco José de Caldas en eventos de divulgación de conocimiento, seminarios y demás actividades que organice el IPAZUD","De cumplimiento","Falta de reconocimiento del IPAZUD por parte de los estudiantes de la Universidad Distrital","Probable - 4","Menor - 2",{"$f":"IF(AND(L65=[2]Datos!$B$65,M65=[2]Datos!$B$72),[2]Datos!$D$65,IF(AND(L65=[2]Datos!$B$65,M65=[2]Datos!$B$73),[2]Datos!$E$65,IF(AND(L65=[2]Datos!$B$65,M65=[2]Datos!$B$74),[2]Datos!$F$65,IF(AND(L65=[2]Datos!$B$65,M65=[2]Datos!$B$75),[2]Datos!$G$65,IF(AND(L65=[2]Datos!$B$65,M65=[2]Datos!$B$76),[2]Datos!$H$65,IF(AND(L65=[2]Datos!$B$66,M65=[2]Datos!$B$72),[2]Datos!$D$66,IF(AND(L65=[2]Datos!$B$66,M65=[2]Datos!$B$73),[2]Datos!$E$66,IF(AND(L65=[2]Datos!$B$66,M65=[2]Datos!$B$74),[2]Datos!$F$66,IF(AND(L65=[2]Datos!$B$66,M65=[2]Datos!$B$75),[2]Datos!$G$66,IF(AND(L65=[2]Datos!$B$66,M65=[2]Datos!$B$76),[2]Datos!$H$66,IF(AND(L65=[2]Datos!$B$67,M65=[2]Datos!$B$72),[2]Datos!$D$67,IF(AND(L65=[2]Datos!$B$67,M65=[2]Datos!$B$73),[2]Datos!$E$67,IF(AND(L65=[2]Datos!$B$67,M65=[2]Datos!$B$74),[2]Datos!$F$67,IF(AND(L65=[2]Datos!$B$67,M65=[2]Datos!$B$75),[2]Datos!$G$67,IF(AND(L65=[2]Datos!$B$67,M65=[2]Datos!$B$76),[2]Datos!$H$67,IF(AND(L65=[2]Datos!$B$68,M65=[2]Datos!$B$72),[2]Datos!$D$68,IF(AND(L65=[2]Datos!$B$68,M65=[2]Datos!$B$73),[2]Datos!$E$68,IF(AND(L65=[2]Datos!$B$68,M65=[2]Datos!$B$74),[2]Datos!$F$68,IF(AND(L65=[2]Datos!$B$68,M65=[2]Datos!$B$75),[2]Datos!$G$68,IF(AND(L65=[2]Datos!$B$68,M65=[2]Datos!$B$76),[2]Datos!$H$68,IF(AND(L65=[2]Datos!$B$69,M65=[2]Datos!$B$72),[2]Datos!$D$69,IF(AND(L65=[2]Datos!$B$69,M65=[2]Datos!$B$73),[2]Datos!$E$69,IF(AND(L65=[2]Datos!$B$69,M65=[2]Datos!$B$74),[2]Datos!$F$69,IF(AND(L65=[2]Datos!$B$69,M65=[2]Datos!$B$75),[2]Datos!$G$69,IF(AND(L65=[2]Datos!$B$69,M65=[2]Datos!$B$76),[2]Datos!$H$69,\"-\")))))))))))))))))))))))))","v":"ALTA - IMPORTANTE 8"},"Plan de divulgación del evento por parte del IPAZUD a la comunidad universitaria (Página web- afiches-redes sociales- emisora UD)","Preventivo ","Alto - 25","Alto - 25","Medio - 15","Alto - 25",{"$f":"((IF(Q65=[2]Datos!$B$83,0,IF(Q65=[2]Datos!$B$84,5,IF(Q65=[2]Datos!$B$85,10,IF(Q65=[2]Datos!$B$86,15,IF(Q65=[2]Datos!$B$87,20,IF(Q65=[2]Datos!$B$88,25,0)))))))/100)+((IF(R65=[2]Datos!$B$83,0,IF(R65=[2]Datos!$B$84,5,IF(R65=[2]Datos!$B$85,10,IF(R65=[2]Datos!$B$86,15,IF(R65=[2]Datos!$B$87,20,IF(R65=[2]Datos!$B$88,25,0)))))))/100)+((IF(S65=[2]Datos!$B$83,0,IF(S65=[2]Datos!$B$84,5,IF(S65=[2]Datos!$B$85,10,IF(S65=[2]Datos!$B$86,15,IF(S65=[2]Datos!$B$87,20,IF(S65=[2]Datos!$B$88,25,0)))))))/100)+((IF(T65=[2]Datos!$B$83,0,IF(T65=[2]Datos!$B$84,5,IF(T65=[2]Datos!$B$85,10,IF(T65=[2]Datos!$B$86,15,IF(T65=[2]Datos!$B$87,20,IF(T65=[2]Datos!$B$88,25,0)))))))/100)","v":0.9},{"$f":"IF(ISERROR((IF(P65=[2]Datos!$B$80,U65,0)+IF(P66=[2]Datos!$B$80,U66,0)+IF(P67=[2]Datos!$B$80,U67,0)+IF(P68=[2]Datos!$B$80,U68,0)+IF(P69=[2]Datos!$B$80,U69,0)+IF(P70=[2]Datos!$B$80,U70,0))/(IF(P65=[2]Datos!$B$80,1,0)+IF(P66=[2]Datos!$B$80,1,0)+IF(P67=[2]Datos!$B$80,1,0)+IF(P68=[2]Datos!$B$80,1,0)+IF(P69=[2]Datos!$B$80,1,0)+IF(P70=[2]Datos!$B$80,1,0))),0,(IF(P65=[2]Datos!$B$80,U65,0)+IF(P66=[2]Datos!$B$80,U66,0)+IF(P67=[2]Datos!$B$80,U67,0)+IF(P68=[2]Datos!$B$80,U68,0)+IF(P69=[2]Datos!$B$80,U69,0)+IF(P70=[2]Datos!$B$80,U70,0))/(IF(P65=[2]Datos!$B$80,1,0)+IF(P66=[2]Datos!$B$80,1,0)+IF(P67=[2]Datos!$B$80,1,0)+IF(P68=[2]Datos!$B$80,1,0)+IF(P69=[2]Datos!$B$80,1,0)+IF(P70=[2]Datos!$B$80,1,0)))","v":0.9},{"$f":"IF(L65=\"\",\"-\",(IF(V65>0,(IF(L65=[2]Datos!$B$65,[2]Datos!$B$65,IF(AND(L65=[2]Datos!$B$66,V65>0.49),[2]Datos!$B$65,IF(AND(L65=[2]Datos!$B$67,V65>0.74),[2]Datos!$B$65,IF(AND(L65=[2]Datos!$B$67,V65<0.75,V65>0.49),[2]Datos!$B$66,IF(AND(L65=[2]Datos!$B$68,V65>0.74),[2]Datos!$B$66,IF(AND(L65=[2]Datos!$B$68,V65<0.75,V65>0.49),[2]Datos!$B$67,IF(AND(L65=[2]Datos!$B$69,V65>0.74),[2]Datos!$B$67,IF(AND(L65=[2]Datos!$B$69,V65<0.75,V65>0.49),[2]Datos!$B$68,L65))))))))),L65)))","v":"Improbable - 2"},{"$f":"IF(ISERROR((IF(P65=[2]Datos!$B$79,U65,0)+IF(P66=[2]Datos!$B$79,U66,0)+IF(P67=[2]Datos!$B$79,U67,0)+IF(P68=[2]Datos!$B$79,U68,0)+IF(P69=[2]Datos!$B$79,U69,0)+IF(P70=[2]Datos!$B$79,U70,0))/(IF(P65=[2]Datos!$B$79,1,0)+IF(P66=[2]Datos!$B$79,1,0)+IF(P67=[2]Datos!$B$79,1,0)+IF(P68=[2]Datos!$B$79,1,0)+IF(P69=[2]Datos!$B$79,1,0)+IF(P70=[2]Datos!$B$79,1,0))),0,(IF(P65=[2]Datos!$B$79,U65,0)+IF(P66=[2]Datos!$B$79,U66,0)+IF(P67=[2]Datos!$B$79,U67,0)+IF(P68=[2]Datos!$B$79,U68,0)+IF(P69=[2]Datos!$B$79,U69,0)+IF(P70=[2]Datos!$B$79,U70,0))/(IF(P65=[2]Datos!$B$79,1,0)+IF(P66=[2]Datos!$B$79,1,0)+IF(P67=[2]Datos!$B$79,1,0)+IF(P68=[2]Datos!$B$79,1,0)+IF(P69=[2]Datos!$B$79,1,0)+IF(P70=[2]Datos!$B$79,1,0)))","v":0},{"$f":"IF(M65=\"\",\"-\",(IF(X65>0,(IF(M65=[2]Datos!$B$72,[2]Datos!$B$72,IF(AND(M65=[2]Datos!$B$73,X65>0.49),[2]Datos!$B$72,IF(AND(M65=[2]Datos!$B$74,X65>0.74),[2]Datos!$B$72,IF(AND(M65=[2]Datos!$B$74,X65<0.75,X65>0.49),[2]Datos!$B$73,IF(AND(M65=[2]Datos!$B$75,X65>0.74),[2]Datos!$B$73,IF(AND(M65=[2]Datos!$B$75,X65<0.75,X65>0.49),[2]Datos!$B$74,IF(AND(M65=[2]Datos!$B$76,X65>0.74),[2]Datos!$B$74,IF(AND(M65=[2]Datos!$B$76,X65<0.75,X65>0.49),[2]Datos!$B$75,M65))))))))),M65)))","v":"Menor - 2"},{"$f":"IF(AND(W65=[2]Datos!$B$65,Y65=[2]Datos!$B$72),[2]Datos!$D$65,IF(AND(W65=[2]Datos!$B$65,Y65=[2]Datos!$B$73),[2]Datos!$E$65,IF(AND(W65=[2]Datos!$B$65,Y65=[2]Datos!$B$74),[2]Datos!$F$65,IF(AND(W65=[2]Datos!$B$65,Y65=[2]Datos!$B$75),[2]Datos!$G$65,IF(AND(W65=[2]Datos!$B$65,Y65=[2]Datos!$B$76),[2]Datos!$H$65,IF(AND(W65=[2]Datos!$B$66,Y65=[2]Datos!$B$72),[2]Datos!$D$66,IF(AND(W65=[2]Datos!$B$66,Y65=[2]Datos!$B$73),[2]Datos!$E$66,IF(AND(W65=[2]Datos!$B$66,Y65=[2]Datos!$B$74),[2]Datos!$F$66,IF(AND(W65=[2]Datos!$B$66,Y65=[2]Datos!$B$75),[2]Datos!$G$66,IF(AND(W65=[2]Datos!$B$66,Y65=[2]Datos!$B$76),[2]Datos!$H$66,IF(AND(W65=[2]Datos!$B$67,Y65=[2]Datos!$B$72),[2]Datos!$D$67,IF(AND(W65=[2]Datos!$B$67,Y65=[2]Datos!$B$73),[2]Datos!$E$67,IF(AND(W65=[2]Datos!$B$67,Y65=[2]Datos!$B$74),[2]Datos!$F$67,IF(AND(W65=[2]Datos!$B$67,Y65=[2]Datos!$B$75),[2]Datos!$G$67,IF(AND(W65=[2]Datos!$B$67,Y65=[2]Datos!$B$76),[2]Datos!$H$67,IF(AND(W65=[2]Datos!$B$68,Y65=[2]Datos!$B$72),[2]Datos!$D$68,IF(AND(W65=[2]Datos!$B$68,Y65=[2]Datos!$B$73),[2]Datos!$E$68,IF(AND(W65=[2]Datos!$B$68,Y65=[2]Datos!$B$74),[2]Datos!$F$68,IF(AND(W65=[2]Datos!$B$68,Y65=[2]Datos!$B$75),[2]Datos!$G$68,IF(AND(W65=[2]Datos!$B$68,Y65=[2]Datos!$B$76),[2]Datos!$H$68,IF(AND(W65=[2]Datos!$B$69,Y65=[2]Datos!$B$72),[2]Datos!$D$69,IF(AND(W65=[2]Datos!$B$69,Y65=[2]Datos!$B$73),[2]Datos!$E$69,IF(AND(W65=[2]Datos!$B$69,Y65=[2]Datos!$B$74),[2]Datos!$F$69,IF(AND(W65=[2]Datos!$B$69,Y65=[2]Datos!$B$75),[2]Datos!$G$69,IF(AND(W65=[2]Datos!$B$69,Y65=[2]Datos!$B$76),[2]Datos!$H$69,\"-\")))))))))))))))))))))))))","v":"BAJO - ACEPTABLE 4"},"Reducir (RE)"]
[null,null,null,null,"Falta de interés por parte de los estudiantes",null,"Externo",null,null,null,"Pérdida de recursos económicos y humanos",null,null,null,null,null,null,null,null,null,{"$f":"((IF(Q66=[2]Datos!$B$83,0,IF(Q66=[2]Datos!$B$84,5,IF(Q66=[2]Datos!$B$85,10,IF(Q66=[2]Datos!$B$86,15,IF(Q66=[2]Datos!$B$87,20,IF(Q66=[2]Datos!$B$88,25,0)))))))/100)+((IF(R66=[2]Datos!$B$83,0,IF(R66=[2]Datos!$B$84,5,IF(R66=[2]Datos!$B$85,10,IF(R66=[2]Datos!$B$86,15,IF(R66=[2]Datos!$B$87,20,IF(R66=[2]Datos!$B$88,25,0)))))))/100)+((IF(S66=[2]Datos!$B$83,0,IF(S66=[2]Datos!$B$84,5,IF(S66=[2]Datos!$B$85,10,IF(S66=[2]Datos!$B$86,15,IF(S66=[2]Datos!$B$87,20,IF(S66=[2]Datos!$B$88,25,0)))))))/100)+((IF(T66=[2]Datos!$B$83,0,IF(T66=[2]Datos!$B$84,5,IF(T66=[2]Datos!$B$85,10,IF(T66=[2]Datos!$B$86,15,IF(T66=[2]Datos!$B$87,20,IF(T66=[2]Datos!$B$88,25,0)))))))/100)","v":0}]
[null,null,null,null,null,null,null,null,null,null,"Falta de motivación por parte de los docentes de la universidad ",null,null,null,null,null,null,null,null,null,{"$f":"((IF(Q67=[2]Datos!$B$83,0,IF(Q67=[2]Datos!$B$84,5,IF(Q67=[2]Datos!$B$85,10,IF(Q67=[2]Datos!$B$86,15,IF(Q67=[2]Datos!$B$87,20,IF(Q67=[2]Datos!$B$88,25,0)))))))/100)+((IF(R67=[2]Datos!$B$83,0,IF(R67=[2]Datos!$B$84,5,IF(R67=[2]Datos!$B$85,10,IF(R67=[2]Datos!$B$86,15,IF(R67=[2]Datos!$B$87,20,IF(R67=[2]Datos!$B$88,25,0)))))))/100)+((IF(S67=[2]Datos!$B$83,0,IF(S67=[2]Datos!$B$84,5,IF(S67=[2]Datos!$B$85,10,IF(S67=[2]Datos!$B$86,15,IF(S67=[2]Datos!$B$87,20,IF(S67=[2]Datos!$B$88,25,0)))))))/100)+((IF(T67=[2]Datos!$B$83,0,IF(T67=[2]Datos!$B$84,5,IF(T67=[2]Datos!$B$85,10,IF(T67=[2]Datos!$B$86,15,IF(T67=[2]Datos!$B$87,20,IF(T67=[2]Datos!$B$88,25,0)))))))/100)","v":0}]
[null,null,null,null,null,null,null,null,null,null,null,null,null,null,null,null,null,null,null,null,{"$f":"((IF(Q68=[2]Datos!$B$83,0,IF(Q68=[2]Datos!$B$84,5,IF(Q68=[2]Datos!$B$85,10,IF(Q68=[2]Datos!$B$86,15,IF(Q68=[2]Datos!$B$87,20,IF(Q68=[2]Datos!$B$88,25,0)))))))/100)+((IF(R68=[2]Datos!$B$83,0,IF(R68=[2]Datos!$B$84,5,IF(R68=[2]Datos!$B$85,10,IF(R68=[2]Datos!$B$86,15,IF(R68=[2]Datos!$B$87,20,IF(R68=[2]Datos!$B$88,25,0)))))))/100)+((IF(S68=[2]Datos!$B$83,0,IF(S68=[2]Datos!$B$84,5,IF(S68=[2]Datos!$B$85,10,IF(S68=[2]Datos!$B$86,15,IF(S68=[2]Datos!$B$87,20,IF(S68=[2]Datos!$B$88,25,0)))))))/100)+((IF(T68=[2]Datos!$B$83,0,IF(T68=[2]Datos!$B$84,5,IF(T68=[2]Datos!$B$85,10,IF(T68=[2]Datos!$B$86,15,IF(T68=[2]Datos!$B$87,20,IF(T68=[2]Datos!$B$88,25,0)))))))/100)","v":0}]
[null,null,null,null,null,null,null,null,null,null,null,null,null,null,null,null,null,null,null,null,{"$f":"((IF(Q69=[2]Datos!$B$83,0,IF(Q69=[2]Datos!$B$84,5,IF(Q69=[2]Datos!$B$85,10,IF(Q69=[2]Datos!$B$86,15,IF(Q69=[2]Datos!$B$87,20,IF(Q69=[2]Datos!$B$88,25,0)))))))/100)+((IF(R69=[2]Datos!$B$83,0,IF(R69=[2]Datos!$B$84,5,IF(R69=[2]Datos!$B$85,10,IF(R69=[2]Datos!$B$86,15,IF(R69=[2]Datos!$B$87,20,IF(R69=[2]Datos!$B$88,25,0)))))))/100)+((IF(S69=[2]Datos!$B$83,0,IF(S69=[2]Datos!$B$84,5,IF(S69=[2]Datos!$B$85,10,IF(S69=[2]Datos!$B$86,15,IF(S69=[2]Datos!$B$87,20,IF(S69=[2]Datos!$B$88,25,0)))))))/100)+((IF(T69=[2]Datos!$B$83,0,IF(T69=[2]Datos!$B$84,5,IF(T69=[2]Datos!$B$85,10,IF(T69=[2]Datos!$B$86,15,IF(T69=[2]Datos!$B$87,20,IF(T69=[2]Datos!$B$88,25,0)))))))/100)","v":0}]
[null,null,null,null,null,null,null,null,null,null,null,null,null,null,null,null,null,null,null,null,{"$f":"((IF(Q70=[2]Datos!$B$83,0,IF(Q70=[2]Datos!$B$84,5,IF(Q70=[2]Datos!$B$85,10,IF(Q70=[2]Datos!$B$86,15,IF(Q70=[2]Datos!$B$87,20,IF(Q70=[2]Datos!$B$88,25,0)))))))/100)+((IF(R70=[2]Datos!$B$83,0,IF(R70=[2]Datos!$B$84,5,IF(R70=[2]Datos!$B$85,10,IF(R70=[2]Datos!$B$86,15,IF(R70=[2]Datos!$B$87,20,IF(R70=[2]Datos!$B$88,25,0)))))))/100)+((IF(S70=[2]Datos!$B$83,0,IF(S70=[2]Datos!$B$84,5,IF(S70=[2]Datos!$B$85,10,IF(S70=[2]Datos!$B$86,15,IF(S70=[2]Datos!$B$87,20,IF(S70=[2]Datos!$B$88,25,0)))))))/100)+((IF(T70=[2]Datos!$B$83,0,IF(T70=[2]Datos!$B$84,5,IF(T70=[2]Datos!$B$85,10,IF(T70=[2]Datos!$B$86,15,IF(T70=[2]Datos!$B$87,20,IF(T70=[2]Datos!$B$88,25,0)))))))/100)","v":0}]
[null,"Extensión y Proyección Social",null,{"$f":"IF(B71=\"\",\"-\",VLOOKUP(B71,[2]Datos!$B$4:$C$25,2,FALSE))","v":"Promover la Vinculación de la Universidad Distrital Francisco José de Caldas con su Entorno social, a través de la coordinación de los programas, planes y proyectos de Extensión y Proyección Social, en articulación a la Docencia y la Investigación."},"Falta de disponibilidad presupuestal",null,"Externo","Incumplimiento de las publicaciones proyectadas por el IPAZUD en el Plan de Acción anual","No se realizan las publicaciones proyectadas por el IPAZUD en el Plan de acción anual","De cumplimiento","Incumplimiento del Plan de acción del IPAZUD","Improbable - 2","Moderado - 3",{"$f":"IF(AND(L71=[2]Datos!$B$65,M71=[2]Datos!$B$72),[2]Datos!$D$65,IF(AND(L71=[2]Datos!$B$65,M71=[2]Datos!$B$73),[2]Datos!$E$65,IF(AND(L71=[2]Datos!$B$65,M71=[2]Datos!$B$74),[2]Datos!$F$65,IF(AND(L71=[2]Datos!$B$65,M71=[2]Datos!$B$75),[2]Datos!$G$65,IF(AND(L71=[2]Datos!$B$65,M71=[2]Datos!$B$76),[2]Datos!$H$65,IF(AND(L71=[2]Datos!$B$66,M71=[2]Datos!$B$72),[2]Datos!$D$66,IF(AND(L71=[2]Datos!$B$66,M71=[2]Datos!$B$73),[2]Datos!$E$66,IF(AND(L71=[2]Datos!$B$66,M71=[2]Datos!$B$74),[2]Datos!$F$66,IF(AND(L71=[2]Datos!$B$66,M71=[2]Datos!$B$75),[2]Datos!$G$66,IF(AND(L71=[2]Datos!$B$66,M71=[2]Datos!$B$76),[2]Datos!$H$66,IF(AND(L71=[2]Datos!$B$67,M71=[2]Datos!$B$72),[2]Datos!$D$67,IF(AND(L71=[2]Datos!$B$67,M71=[2]Datos!$B$73),[2]Datos!$E$67,IF(AND(L71=[2]Datos!$B$67,M71=[2]Datos!$B$74),[2]Datos!$F$67,IF(AND(L71=[2]Datos!$B$67,M71=[2]Datos!$B$75),[2]Datos!$G$67,IF(AND(L71=[2]Datos!$B$67,M71=[2]Datos!$B$76),[2]Datos!$H$67,IF(AND(L71=[2]Datos!$B$68,M71=[2]Datos!$B$72),[2]Datos!$D$68,IF(AND(L71=[2]Datos!$B$68,M71=[2]Datos!$B$73),[2]Datos!$E$68,IF(AND(L71=[2]Datos!$B$68,M71=[2]Datos!$B$74),[2]Datos!$F$68,IF(AND(L71=[2]Datos!$B$68,M71=[2]Datos!$B$75),[2]Datos!$G$68,IF(AND(L71=[2]Datos!$B$68,M71=[2]Datos!$B$76),[2]Datos!$H$68,IF(AND(L71=[2]Datos!$B$69,M71=[2]Datos!$B$72),[2]Datos!$D$69,IF(AND(L71=[2]Datos!$B$69,M71=[2]Datos!$B$73),[2]Datos!$E$69,IF(AND(L71=[2]Datos!$B$69,M71=[2]Datos!$B$74),[2]Datos!$F$69,IF(AND(L71=[2]Datos!$B$69,M71=[2]Datos!$B$75),[2]Datos!$G$69,IF(AND(L71=[2]Datos!$B$69,M71=[2]Datos!$B$76),[2]Datos!$H$69,\"-\")))))))))))))))))))))))))","v":"MODERADO 6"},"Elaboración de cronograma para que las novedades editoriales tengan lanzamiento en la feria del libro ","Preventivo ","Alto - 25","Alto - 25","Alto - 25","Alto - 25",{"$f":"((IF(Q71=[2]Datos!$B$83,0,IF(Q71=[2]Datos!$B$84,5,IF(Q71=[2]Datos!$B$85,10,IF(Q71=[2]Datos!$B$86,15,IF(Q71=[2]Datos!$B$87,20,IF(Q71=[2]Datos!$B$88,25,0)))))))/100)+((IF(R71=[2]Datos!$B$83,0,IF(R71=[2]Datos!$B$84,5,IF(R71=[2]Datos!$B$85,10,IF(R71=[2]Datos!$B$86,15,IF(R71=[2]Datos!$B$87,20,IF(R71=[2]Datos!$B$88,25,0)))))))/100)+((IF(S71=[2]Datos!$B$83,0,IF(S71=[2]Datos!$B$84,5,IF(S71=[2]Datos!$B$85,10,IF(S71=[2]Datos!$B$86,15,IF(S71=[2]Datos!$B$87,20,IF(S71=[2]Datos!$B$88,25,0)))))))/100)+((IF(T71=[2]Datos!$B$83,0,IF(T71=[2]Datos!$B$84,5,IF(T71=[2]Datos!$B$85,10,IF(T71=[2]Datos!$B$86,15,IF(T71=[2]Datos!$B$87,20,IF(T71=[2]Datos!$B$88,25,0)))))))/100)","v":1},{"$f":"IF(ISERROR((IF(P71=[2]Datos!$B$80,U71,0)+IF(P72=[2]Datos!$B$80,U72,0)+IF(P73=[2]Datos!$B$80,U73,0)+IF(P74=[2]Datos!$B$80,U74,0)+IF(P75=[2]Datos!$B$80,U75,0)+IF(P76=[2]Datos!$B$80,U76,0))/(IF(P71=[2]Datos!$B$80,1,0)+IF(P72=[2]Datos!$B$80,1,0)+IF(P73=[2]Datos!$B$80,1,0)+IF(P74=[2]Datos!$B$80,1,0)+IF(P75=[2]Datos!$B$80,1,0)+IF(P76=[2]Datos!$B$80,1,0))),0,(IF(P71=[2]Datos!$B$80,U71,0)+IF(P72=[2]Datos!$B$80,U72,0)+IF(P73=[2]Datos!$B$80,U73,0)+IF(P74=[2]Datos!$B$80,U74,0)+IF(P75=[2]Datos!$B$80,U75,0)+IF(P76=[2]Datos!$B$80,U76,0))/(IF(P71=[2]Datos!$B$80,1,0)+IF(P72=[2]Datos!$B$80,1,0)+IF(P73=[2]Datos!$B$80,1,0)+IF(P74=[2]Datos!$B$80,1,0)+IF(P75=[2]Datos!$B$80,1,0)+IF(P76=[2]Datos!$B$80,1,0)))","v":0.98333333333333339},{"$f":"IF(L71=\"\",\"-\",(IF(V71>0,(IF(L71=[2]Datos!$B$65,[2]Datos!$B$65,IF(AND(L71=[2]Datos!$B$66,V71>0.49),[2]Datos!$B$65,IF(AND(L71=[2]Datos!$B$67,V71>0.74),[2]Datos!$B$65,IF(AND(L71=[2]Datos!$B$67,V71<0.75,V71>0.49),[2]Datos!$B$66,IF(AND(L71=[2]Datos!$B$68,V71>0.74),[2]Datos!$B$66,IF(AND(L71=[2]Datos!$B$68,V71<0.75,V71>0.49),[2]Datos!$B$67,IF(AND(L71=[2]Datos!$B$69,V71>0.74),[2]Datos!$B$67,IF(AND(L71=[2]Datos!$B$69,V71<0.75,V71>0.49),[2]Datos!$B$68,L71))))))))),L71)))","v":"Raro - 1"},{"$f":"IF(ISERROR((IF(P71=[2]Datos!$B$79,U71,0)+IF(P72=[2]Datos!$B$79,U72,0)+IF(P73=[2]Datos!$B$79,U73,0)+IF(P74=[2]Datos!$B$79,U74,0)+IF(P75=[2]Datos!$B$79,U75,0)+IF(P76=[2]Datos!$B$79,U76,0))/(IF(P71=[2]Datos!$B$79,1,0)+IF(P72=[2]Datos!$B$79,1,0)+IF(P73=[2]Datos!$B$79,1,0)+IF(P74=[2]Datos!$B$79,1,0)+IF(P75=[2]Datos!$B$79,1,0)+IF(P76=[2]Datos!$B$79,1,0))),0,(IF(P71=[2]Datos!$B$79,U71,0)+IF(P72=[2]Datos!$B$79,U72,0)+IF(P73=[2]Datos!$B$79,U73,0)+IF(P74=[2]Datos!$B$79,U74,0)+IF(P75=[2]Datos!$B$79,U75,0)+IF(P76=[2]Datos!$B$79,U76,0))/(IF(P71=[2]Datos!$B$79,1,0)+IF(P72=[2]Datos!$B$79,1,0)+IF(P73=[2]Datos!$B$79,1,0)+IF(P74=[2]Datos!$B$79,1,0)+IF(P75=[2]Datos!$B$79,1,0)+IF(P76=[2]Datos!$B$79,1,0)))","v":0},{"$f":"IF(M71=\"\",\"-\",(IF(X71>0,(IF(M71=[2]Datos!$B$72,[2]Datos!$B$72,IF(AND(M71=[2]Datos!$B$73,X71>0.49),[2]Datos!$B$72,IF(AND(M71=[2]Datos!$B$74,X71>0.74),[2]Datos!$B$72,IF(AND(M71=[2]Datos!$B$74,X71<0.75,X71>0.49),[2]Datos!$B$73,IF(AND(M71=[2]Datos!$B$75,X71>0.74),[2]Datos!$B$73,IF(AND(M71=[2]Datos!$B$75,X71<0.75,X71>0.49),[2]Datos!$B$74,IF(AND(M71=[2]Datos!$B$76,X71>0.74),[2]Datos!$B$74,IF(AND(M71=[2]Datos!$B$76,X71<0.75,X71>0.49),[2]Datos!$B$75,M71))))))))),M71)))","v":"Moderado - 3"},{"$f":"IF(AND(W71=[2]Datos!$B$65,Y71=[2]Datos!$B$72),[2]Datos!$D$65,IF(AND(W71=[2]Datos!$B$65,Y71=[2]Datos!$B$73),[2]Datos!$E$65,IF(AND(W71=[2]Datos!$B$65,Y71=[2]Datos!$B$74),[2]Datos!$F$65,IF(AND(W71=[2]Datos!$B$65,Y71=[2]Datos!$B$75),[2]Datos!$G$65,IF(AND(W71=[2]Datos!$B$65,Y71=[2]Datos!$B$76),[2]Datos!$H$65,IF(AND(W71=[2]Datos!$B$66,Y71=[2]Datos!$B$72),[2]Datos!$D$66,IF(AND(W71=[2]Datos!$B$66,Y71=[2]Datos!$B$73),[2]Datos!$E$66,IF(AND(W71=[2]Datos!$B$66,Y71=[2]Datos!$B$74),[2]Datos!$F$66,IF(AND(W71=[2]Datos!$B$66,Y71=[2]Datos!$B$75),[2]Datos!$G$66,IF(AND(W71=[2]Datos!$B$66,Y71=[2]Datos!$B$76),[2]Datos!$H$66,IF(AND(W71=[2]Datos!$B$67,Y71=[2]Datos!$B$72),[2]Datos!$D$67,IF(AND(W71=[2]Datos!$B$67,Y71=[2]Datos!$B$73),[2]Datos!$E$67,IF(AND(W71=[2]Datos!$B$67,Y71=[2]Datos!$B$74),[2]Datos!$F$67,IF(AND(W71=[2]Datos!$B$67,Y71=[2]Datos!$B$75),[2]Datos!$G$67,IF(AND(W71=[2]Datos!$B$67,Y71=[2]Datos!$B$76),[2]Datos!$H$67,IF(AND(W71=[2]Datos!$B$68,Y71=[2]Datos!$B$72),[2]Datos!$D$68,IF(AND(W71=[2]Datos!$B$68,Y71=[2]Datos!$B$73),[2]Datos!$E$68,IF(AND(W71=[2]Datos!$B$68,Y71=[2]Datos!$B$74),[2]Datos!$F$68,IF(AND(W71=[2]Datos!$B$68,Y71=[2]Datos!$B$75),[2]Datos!$G$68,IF(AND(W71=[2]Datos!$B$68,Y71=[2]Datos!$B$76),[2]Datos!$H$68,IF(AND(W71=[2]Datos!$B$69,Y71=[2]Datos!$B$72),[2]Datos!$D$69,IF(AND(W71=[2]Datos!$B$69,Y71=[2]Datos!$B$73),[2]Datos!$E$69,IF(AND(W71=[2]Datos!$B$69,Y71=[2]Datos!$B$74),[2]Datos!$F$69,IF(AND(W71=[2]Datos!$B$69,Y71=[2]Datos!$B$75),[2]Datos!$G$69,IF(AND(W71=[2]Datos!$B$69,Y71=[2]Datos!$B$76),[2]Datos!$H$69,\"-\")))))))))))))))))))))))))","v":"MODERADO 3"},"Asumir (AS)"]
[null,null,null,null,"Demora en tramites administrativos",null,"Externo",null,null,null,"Falta de visibilidad del IPAZUD en la comunidad",null,null,null,"Contratación de personal para agilizar el proceso editorial","Preventivo ","Alto - 25","Medio Alto - 20","Alto - 25","Alto - 25",{"$f":"((IF(Q72=[2]Datos!$B$83,0,IF(Q72=[2]Datos!$B$84,5,IF(Q72=[2]Datos!$B$85,10,IF(Q72=[2]Datos!$B$86,15,IF(Q72=[2]Datos!$B$87,20,IF(Q72=[2]Datos!$B$88,25,0)))))))/100)+((IF(R72=[2]Datos!$B$83,0,IF(R72=[2]Datos!$B$84,5,IF(R72=[2]Datos!$B$85,10,IF(R72=[2]Datos!$B$86,15,IF(R72=[2]Datos!$B$87,20,IF(R72=[2]Datos!$B$88,25,0)))))))/100)+((IF(S72=[2]Datos!$B$83,0,IF(S72=[2]Datos!$B$84,5,IF(S72=[2]Datos!$B$85,10,IF(S72=[2]Datos!$B$86,15,IF(S72=[2]Datos!$B$87,20,IF(S72=[2]Datos!$B$88,25,0)))))))/100)+((IF(T72=[2]Datos!$B$83,0,IF(T72=[2]Datos!$B$84,5,IF(T72=[2]Datos!$B$85,10,IF(T72=[2]Datos!$B$86,15,IF(T72=[2]Datos!$B$87,20,IF(T72=[2]Datos!$B$88,25,0)))))))/100)","v":0.95}]
[null,null,null,null,"Falta de seguimiento y control en el   desarrollo de las publicaciones",null,"Interno",null,null,null,"Dejar de aportar conocimiento para aprendizaje de estudiantes y docentes.",null,null,null,"Convocatoria y recepción de textos en fechas específicas","Preventivo ","Alto - 25","Alto - 25","Alto - 25","Alto - 25",{"$f":"((IF(Q73=[2]Datos!$B$83,0,IF(Q73=[2]Datos!$B$84,5,IF(Q73=[2]Datos!$B$85,10,IF(Q73=[2]Datos!$B$86,15,IF(Q73=[2]Datos!$B$87,20,IF(Q73=[2]Datos!$B$88,25,0)))))))/100)+((IF(R73=[2]Datos!$B$83,0,IF(R73=[2]Datos!$B$84,5,IF(R73=[2]Datos!$B$85,10,IF(R73=[2]Datos!$B$86,15,IF(R73=[2]Datos!$B$87,20,IF(R73=[2]Datos!$B$88,25,0)))))))/100)+((IF(S73=[2]Datos!$B$83,0,IF(S73=[2]Datos!$B$84,5,IF(S73=[2]Datos!$B$85,10,IF(S73=[2]Datos!$B$86,15,IF(S73=[2]Datos!$B$87,20,IF(S73=[2]Datos!$B$88,25,0)))))))/100)+((IF(T73=[2]Datos!$B$83,0,IF(T73=[2]Datos!$B$84,5,IF(T73=[2]Datos!$B$85,10,IF(T73=[2]Datos!$B$86,15,IF(T73=[2]Datos!$B$87,20,IF(T73=[2]Datos!$B$88,25,0)))))))/100)","v":1}]
[null,null,null,null,"Demora en la recepción de textos ",null,"Interno",null,null,null,null,null,null,null,null,null,null,null,null,null,{"$f":"((IF(Q74=[2]Datos!$B$83,0,IF(Q74=[2]Datos!$B$84,5,IF(Q74=[2]Datos!$B$85,10,IF(Q74=[2]Datos!$B$86,15,IF(Q74=[2]Datos!$B$87,20,IF(Q74=[2]Datos!$B$88,25,0)))))))/100)+((IF(R74=[2]Datos!$B$83,0,IF(R74=[2]Datos!$B$84,5,IF(R74=[2]Datos!$B$85,10,IF(R74=[2]Datos!$B$86,15,IF(R74=[2]Datos!$B$87,20,IF(R74=[2]Datos!$B$88,25,0)))))))/100)+((IF(S74=[2]Datos!$B$83,0,IF(S74=[2]Datos!$B$84,5,IF(S74=[2]Datos!$B$85,10,IF(S74=[2]Datos!$B$86,15,IF(S74=[2]Datos!$B$87,20,IF(S74=[2]Datos!$B$88,25,0)))))))/100)+((IF(T74=[2]Datos!$B$83,0,IF(T74=[2]Datos!$B$84,5,IF(T74=[2]Datos!$B$85,10,IF(T74=[2]Datos!$B$86,15,IF(T74=[2]Datos!$B$87,20,IF(T74=[2]Datos!$B$88,25,0)))))))/100)","v":0}]
[null,null,null,null,"Falta de personal capacitado encargado de compilar, editar y realizar correcciones en la publicación",null,"Externo",null,null,null,null,null,null,null,null,null,null,null,null,null,{"$f":"((IF(Q75=[2]Datos!$B$83,0,IF(Q75=[2]Datos!$B$84,5,IF(Q75=[2]Datos!$B$85,10,IF(Q75=[2]Datos!$B$86,15,IF(Q75=[2]Datos!$B$87,20,IF(Q75=[2]Datos!$B$88,25,0)))))))/100)+((IF(R75=[2]Datos!$B$83,0,IF(R75=[2]Datos!$B$84,5,IF(R75=[2]Datos!$B$85,10,IF(R75=[2]Datos!$B$86,15,IF(R75=[2]Datos!$B$87,20,IF(R75=[2]Datos!$B$88,25,0)))))))/100)+((IF(S75=[2]Datos!$B$83,0,IF(S75=[2]Datos!$B$84,5,IF(S75=[2]Datos!$B$85,10,IF(S75=[2]Datos!$B$86,15,IF(S75=[2]Datos!$B$87,20,IF(S75=[2]Datos!$B$88,25,0)))))))/100)+((IF(T75=[2]Datos!$B$83,0,IF(T75=[2]Datos!$B$84,5,IF(T75=[2]Datos!$B$85,10,IF(T75=[2]Datos!$B$86,15,IF(T75=[2]Datos!$B$87,20,IF(T75=[2]Datos!$B$88,25,0)))))))/100)","v":0}]
[null,null,null,null,null,null,null,null,null,null,null,null,null,null,null,null,null,null,null,null,{"$f":"((IF(Q76=[2]Datos!$B$83,0,IF(Q76=[2]Datos!$B$84,5,IF(Q76=[2]Datos!$B$85,10,IF(Q76=[2]Datos!$B$86,15,IF(Q76=[2]Datos!$B$87,20,IF(Q76=[2]Datos!$B$88,25,0)))))))/100)+((IF(R76=[2]Datos!$B$83,0,IF(R76=[2]Datos!$B$84,5,IF(R76=[2]Datos!$B$85,10,IF(R76=[2]Datos!$B$86,15,IF(R76=[2]Datos!$B$87,20,IF(R76=[2]Datos!$B$88,25,0)))))))/100)+((IF(S76=[2]Datos!$B$83,0,IF(S76=[2]Datos!$B$84,5,IF(S76=[2]Datos!$B$85,10,IF(S76=[2]Datos!$B$86,15,IF(S76=[2]Datos!$B$87,20,IF(S76=[2]Datos!$B$88,25,0)))))))/100)+((IF(T76=[2]Datos!$B$83,0,IF(T76=[2]Datos!$B$84,5,IF(T76=[2]Datos!$B$85,10,IF(T76=[2]Datos!$B$86,15,IF(T76=[2]Datos!$B$87,20,IF(T76=[2]Datos!$B$88,25,0)))))))/100)","v":0}]

{"sheet":"SGA","index":3,"n_rows":11,"n_cols":26,"rows_kept":11,"cut":false,"hidden":false,"merged":[[7,6,9,6],[7,1,9,2],[8,8,8,12],[8,13,8,17],[10,1,10,2],[7,3,9,3],[7,4,9,4],[7,5,9,5],[1,1,3,1],[1,2,1,3],[1,5,3,5],[2,2,2,3],[3,2,3,3],[8,25,9,25],[6,7,6,24],[7,7,9,7],[7,8,7,22],[7,23,9,23],[7,24,9,24],[8,18,8,22]]}
[]
[null,null,"MATRIZ INTEGRAL DE RIESGOS ",null,"Código: GI-GUI-002-FR-001"]
[null,null,"Macroproceso: Direccionamiento Estratégico",null,"Versión: 01"]
[null,null,"Proceso: Gestión Integrada",null,"Fecha de Aprobación: XX/XX/XX"]
[]
[null,null,"Subsistema de Gestión Ambiental (SGA)"]
[null,null,null,null,null,null,null,"EVALUACIÓN DEL RIESGO"]
[null,"PROCESO",null,"OBJETIVO DEL PROCESO  ","SEDE","FACTOR DE RIESGO","ACTIVIDADES","PROBABILIDAD","CONSECUENCIA",null,null,null,null,null,null,null,null,null,null,null,null,null,null,"RIESGO AMBIENTAL","CUALIFICACIÓN DEL RIESGO AMBIENTAL"]
[null,null,null,null,null,null,null,null,"ENTORNO HUMANO",null,null,null,null,"ENTORNO NATURAL",null,null,null,null,"ENTORNO SOCIOECONOMICO",null,null,null,null,null,null,"TIPO DE CONTROL"]
[null,null,null,null,null,null,null,null,"CANTIDAD","PELIGROSIDAD","EXTENSIÓN","POBLACIÓN AFECTADA","VALOR","CANTIDAD","PELIGROSIDAD","EXTENSIÓN","POBLACIÓN AFECTADA","VALOR","CANTIDAD","PELIGROSIDAD","EXTENSIÓN","POBLACIÓN AFECTADA","VALOR"]
[null,null,null,{"$f":"IF(B11=\"\",\"-\",VLOOKUP(B11,Datos!$B$3:$C$25,2,FALSE))","v":"-"},null,null,null,null,null,null,null,null,{"$f":"ROUND((((IF(I11=Datos!$B$109,4,IF(I11=Datos!$B$110,3,IF(I11=Datos!$B$111,2,IF(I11=Datos!$B$112,1,0)))))+(IF(J11=Datos!$B$115,4,IF(J11=Datos!$B$116,3,IF(J11=Datos!$B$117,2,IF(J11=Datos!$B$118,1,0)))))+(IF(K11=Datos!$B$121,4,IF(K11=Datos!$B$122,3,IF(K11=Datos!$B$123,2,IF(K11=Datos!$B$124,1,0)))))+(IF(L11=Datos!$B$127,4,IF(L11=Datos!$B$128,3,IF(L11=Datos!$B$129,2,IF(L11=Datos!$B$130,1,0))))))/4),0)","v":0},null,null,null,null,{"$f":"ROUND((((IF(N11=Datos!$B$109,4,IF(N11=Datos!$B$110,3,IF(N11=Datos!$B$111,2,IF(N11=Datos!$B$112,1,0)))))+(IF(O11=Datos!$B$115,4,IF(O11=Datos!$B$116,3,IF(O11=Datos!$B$117,2,IF(O11=Datos!$B$118,1,0)))))+(IF(P11=Datos!$B$121,4,IF(P11=Datos!$B$122,3,IF(P11=Datos!$B$123,2,IF(P11=Datos!$B$124,1,0)))))+(IF(Q11=Datos!$B$127,4,IF(Q11=Datos!$B$128,3,IF(Q11=Datos!$B$129,2,IF(Q11=Datos!$B$130,1,0))))))/4),0)","v":0},null,null,null,null,{"$f":"ROUND((((IF(S11=Datos!$B$109,4,IF(S11=Datos!$B$110,3,IF(S11=Datos!$B$111,2,IF(S11=Datos!$B$112,1,0)))))+(IF(T11=Datos!$B$115,4,IF(T11=Datos!$B$116,3,IF(T11=Datos!$B$117,2,IF(T11=Datos!$B$118,1,0)))))+(IF(U11=Datos!$B$121,4,IF(U11=Datos!$B$122,3,IF(U11=Datos!$B$123,2,IF(U11=Datos!$B$124,1,0)))))+(IF(V11=Datos!$B$127,4,IF(V11=Datos!$B$128,3,IF(V11=Datos!$B$129,2,IF(V11=Datos!$B$130,1,0))))))/4),0)","v":0},{"$f":"IF(H11=Datos!$B$102,5*(M11+R11+W11),IF(H11=Datos!$B$103,4*(M11+R11+W11),IF(H11=Datos!$B$104,3*(M11+R11+W11),IF(H11=Datos!$B$105,2*(M11+R11+W11),IF(H11=Datos!$B$106,1*(M11+R11+W11),0)))))","v":0},{"$f":"IF(X11=0,\"-\",IF(X11>40,\"RIESGO SIGNIFICATIVO\",IF(X11<21,\"RIESGO LEVE\",\"RIESGO MODERADO\")))","v":"-"},{"$f":"IF(Y11=\"RIESGO LEVE\",\"Seguimiento \",IF(Y11=\"RIESGO MODERADO\",\"Seguimiento, control y medidas de mitigación\",IF(Y11=\"RIESGO SIGNIFICATIVO\",\"Riesgo residual (inversión)\",\"-\")))","v":"-"}]

{"sheet":"SGSST","index":4,"n_rows":11,"n_cols":28,"rows_kept":11,"cut":false,"hidden":false,"merged":[[7,5,9,5],[7,6,9,6],[7,7,9,7],[7,8,7,9],[8,26,9,26],[8,27,9,27],[7,26,7,27],[7,21,7,25],[7,11,7,13],[8,22,9,22],[8,23,9,23],[7,14,7,18],[8,24,9,24],[8,25,9,25],[8,21,9,21],[7,20,9,20],[10,1,10,2],[8,11,9,11],[8,12,9,12],[8,13,9,13],[8,19,9,19],[8,14,9,14],[8,15,9,15],[8,16,9,16],[8,17,9,17],[8,18,9,18],[8,8,9,8],[8,9,9,9],[7,10,9,10],[7,1,9,2],[7,3,9,3],[7,4,9,4],[1,1,3,1],[1,2,1,3],[1,5,3,5],[2,2,2,3],[3,2,3,3]]}
[]
[null,null,"MATRIZ INTEGRAL DE RIESGOS ",null,"Código: GI-GUI-002-FR-001"]
[null,null,"Macroproceso: Direccionamiento Estratégico",null,"Versión: 01"]
[null,null,"Proceso: Gestión Integrada",null,"Fecha de Aprobación: XX/XX/XX"]
[]
[null,null,"Subsistema de Gestión de Seguridad y Salud en el Trabajo (SGSST)"]
[]
[null,"PROCESO ",null,"OBJETIVO DEL PROCESO  ","SEDE","ZONA/LUGAR","ACTIVIDADES","¿ES RUTINARIA?","PELIGRO",null,"EFECTOS POSIBLES","CONTROLES EXISTENTES",null,null,"EVALUACIÓN DEL RIESGO",null,null,null,null,"VALORACIÓN DEL RIESGO","No EXPUESTOS","MEDIDAS DE INTERVENCIÓN (PROPUESTAS)",null,null,null,null,"GESTIÓN"]
[null,null,null,null,null,null,null,null,"CLASIFICACIÓN","DESCRIPCIÓN ",null,"FUENTE","MEDIO","TRABAJADOR","N.D","N.E","N.P (N.DxN.E)","N.C","N.R (N.PxN.C)","ACEPTABILIDAD DEL RIESGO",null,"ELIMINACIÓN","SUSTITUCIÓN","CONTROLES DE INGENIERÍA","CONTROLES ADMINISTRATIVOS, SEÑALIZACIÓN Y ADVERTENCIA","EQUIPOS/EPP","PROGRAMA","PROCEDIMIENTO U OTROS"]
[]
[null,null,null,{"$f":"IF(B11=\"\",\"-\",VLOOKUP(B11,Datos!$B$3:$C$25,2,FALSE))","v":"-"},null,null,null,null,null,null,null,null,null,null,null,null,{"$f":"IF(AND(O11=Datos!$B$156,P11=Datos!$B$162),Datos!$D$167,IF(AND(O11=Datos!$B$156,P11=Datos!$B$163),Datos!$E$167,IF(AND(O11=Datos!$B$156,P11=Datos!$B$164),Datos!$F$167,IF(AND(O11=Datos!$B$156,P11=Datos!$B$165),Datos!$G$167,IF(AND(O11=Datos!$B$157,P11=Datos!$B$162),Datos!$D$168,IF(AND(O11=Datos!$B$157,P11=Datos!$B$163),Datos!$E$168,IF(AND(O11=Datos!$B$157,P11=Datos!$B$164),Datos!$F$168,IF(AND(O11=Datos!$B$157,P11=Datos!$B$165),Datos!$G$168,IF(AND(O11=Datos!$B$158,P11=Datos!$B$162),Datos!$D$169,IF(AND(O11=Datos!$B$158,P11=Datos!$B$163),Datos!$E$169,IF(AND(O11=Datos!$B$158,P11=Datos!$B$164),Datos!$F$169,IF(AND(O11=Datos!$B$158,P11=Datos!$B$165),Datos!$G$169,IF(AND(O11=Datos!$B$159,P11=Datos!$B$162),\"N/A\",IF(AND(O11=Datos!$B$159,P11=Datos!$B$163),\"N/A\",IF(AND(O11=Datos!$B$159,P11=Datos!$B$164),\"N/A\",IF(AND(O11=Datos!$B$159,P11=Datos!$B$165),\"N/A\",\"-\"))))))))))))))))","v":"-"},null,{"$f":"(IF(AND(Q11=Datos!$D$167,R11=Datos!$B$171),Datos!$D$176,IF(AND(Q11=Datos!$D$168,R11=Datos!$B$171),Datos!$D$176,IF(AND(Q11=Datos!$D$169,R11=Datos!$B$171),Datos!$F$176,IF(AND(Q11=Datos!$E$167,R11=Datos!$B$171),Datos!$D$176,IF(AND(Q11=Datos!$E$168,R11=Datos!$B$171),Datos!$E$176,IF(AND(Q11=Datos!$E$169,R11=Datos!$B$171),Datos!$F$176,IF(AND(Q11=Datos!$F$167,R11=Datos!$B$171),Datos!$E$176,IF(AND(Q11=Datos!$F$168,R11=Datos!$B$171),Datos!$E$176,IF(AND(Q11=Datos!$F$169,R11=Datos!$B$171),Datos!$G$176,IF(AND(Q11=Datos!$G$167,R11=Datos!$B$171),Datos!$E$176,IF(AND(Q11=Datos!$G$168,R11=Datos!$B$171),Datos!$F$176,IF(AND(Q11=Datos!$G$169,R11=Datos!$B$171),Datos!$G$176,IF(AND(Q11=Datos!$D$167,R11=Datos!$B$172),Datos!$D$178,IF(AND(Q11=Datos!$D$168,R11=Datos!$B$172),Datos!$D$178,IF(AND(Q11=Datos!$D$169,R11=Datos!$B$172),Datos!$F$178,IF(AND(Q11=Datos!$E$167,R11=Datos!$B$172),Datos!$D$178,IF(AND(Q11=Datos!$E$168,R11=Datos!$B$172),Datos!$E$178,IF(AND(Q11=Datos!$E$169,R11=Datos!$B$172),Datos!$F$178,IF(AND(Q11=Datos!$F$167,R11=Datos!$B$172),Datos!$E$178,IF(AND(Q11=Datos!$F$168,R11=Datos!$B$172),Datos!$E$178,IF(AND(Q11=Datos!$F$169,R11=Datos!$B$172),Datos!$G$178,IF(AND(Q11=Datos!$G$167,R11=Datos!$B$172),Datos!$E$178,IF(AND(Q11=Datos!$G$168,R11=Datos!$B$172),Datos!$F$178,IF(AND(Q11=Datos!$G$169,R11=Datos!$B$172),Datos!$G$179,IF(AND(Q11=Datos!$D$167,R11=Datos!$B$173),Datos!$D$180,IF(AND(Q11=Datos!$D$168,R11=Datos!$B$173),Datos!$D$180,IF(AND(Q11=Datos!$D$169,R11=Datos!$B$173),Datos!$F$180,IF(AND(Q11=Datos!$E$167,R11=Datos!$B$173),Datos!$D$180,IF(AND(Q11=Datos!$E$168,R11=Datos!$B$173),Datos!$E$180,IF(AND(Q11=Datos!$E$169,R11=Datos!$B$173),Datos!$F$180,IF(AND(Q11=Datos!$F$167,R11=Datos!$B$173),Datos!$E$180,IF(AND(Q11=Datos!$F$168,R11=Datos!$B$173),Datos!$E$180,IF(AND(Q11=Datos!$F$169,R11=Datos!$B$173),Datos!$G$180,IF(AND(Q11=Datos!$G$167,R11=Datos!$B$173),Datos!$E$180,IF(AND(Q11=Datos!$G$168,R11=Datos!$B$173),Datos!$F$180,IF(AND(Q11=Datos!$G$169,R11=Datos!$B$173),Datos!$G$180,IF(AND(Q11=Datos!$D$167,R11=Datos!$B$174),Datos!$D$182,IF(AND(Q11=Datos!$D$168,R11=Datos!$B$174),Datos!$D$182,IF(AND(Q11=Datos!$D$169,R11=Datos!$B$174),Datos!$F$182,IF(AND(Q11=Datos!$E$167,R11=Datos!$B$174),Datos!$D$182,IF(AND(Q11=Datos!$E$168,R11=Datos!$B$174),Datos!$E$182,IF(AND(Q11=Datos!$E$169,R11=Datos!$B$174),Datos!$F$182,IF(AND(Q11=Datos!$F$167,R11=Datos!$B$174),Datos!$E$182,IF(AND(Q11=Datos!$F$168,R11=Datos!$B$174),Datos!$E$182,IF(AND(Q11=Datos!$F$169,R11=Datos!$B$174),Datos!$G$182,IF(AND(Q11=Datos!$G$167,R11=Datos!$B$174),Datos!$E$183,IF(AND(Q11=Datos!$G$168,R11=Datos!$B$174),Datos!$F$182,IF(AND(Q11=Datos!$G$169,R11=Datos!$B$174),Datos!$G$183,IF(O11=Datos!$B$159,Datos!$G$183,\"-\"))))))))))))))))))))))))))))))))))))))))))))))))))","v":"-"},{"$f":"IF(ISNUMBER(SEARCH(\"Nivel de Riesgo 1\",S11)),\"NO ACEPTABLE\",IF(ISNUMBER(SEARCH(\"Nivel de Riesgo 2\",S11)),\"NO ACEPTABLE O ACEPTABLE CON CONTROL ESPECÍFICO\",IF(ISNUMBER(SEARCH(\"Nivel de Riesgo 3\",S11)),\"ACEPTABLE\",IF(ISNUMBER(SEARCH(\"Nivel de Riesgo 4\",S11)),\"ACEPTABLE\",\"-\"))))","v":"-"}]

{"sheet":"SGSI","index":5,"n_rows":11,"n_cols":27,"rows_kept":11,"cut":false,"hidden":false,"merged":[[8,17,9,17],[8,18,8,21],[8,22,9,22],[8,23,9,23],[8,24,9,24],[8,25,9,25],[10,1,10,2],[10,4,10,5],[7,4,9,5],[8,14,9,14],[8,15,9,15],[8,16,9,16],[7,17,7,26],[8,26,9,26],[8,13,9,13],[7,6,9,6],[7,7,9,7],[7,8,9,8],[7,9,7,11],[8,9,9,9],[8,10,9,10],[8,11,9,11],[8,12,9,12],[1,1,3,1],[1,2,1,3],[1,5,3,5],[2,2,2,3],[3,2,3,3],[7,1,9,2],[7,3,9,3],[7,12,7,16]]}
[]
[null,null,"MATRIZ INTEGRAL DE RIESGOS ",null,"Código: GI-GUI-002-FR-001"]
[null,null,"Macroproceso: Direccionamiento Estratégico",null,"Versión: 01"]
[null,null,"Proceso: Gestión Integrada",null,"Fecha de Aprobación: XX/XX/XX"]
[]
[null,null,"Subsistema de Seguridad de la Información (SGSI)"]
[]
[null,"PROCESO",null,"OBJETIVO DEL PROCESO  ","ACTIVO DE INFORMACIÓN",null,"AMENAZA (RIESGO)","VULNERABILIDAD (CAUSAS)","CONSECUENCIAS","CLASIFICACIÓN",null,null,"CONTROLES",null,null,null,null,"EVALUACIÓN DE CONTROLES"]
[null,null,null,null,null,null,null,null,null,"PROBABILIDAD","IMPACTO ","ZONA DE RIESGO","ACCIONES DE CONTROL Y/O MEJORA","METAS","FECHA DE INICIO","FECHA DE FINALIZACIÒN","RESPONSABLE","TIPO DE CONTROL","NIVEL",null,null,null,"RIESGO CONTROLADO","PROBABILIDAD RESIDUAL","IMPACTO RESIDUAL","ZONA DE RIESGO RESIDUAL","ACCIONES DE CONTROL RESIDUALES"]
[null,null,null,null,null,null,null,null,null,null,null,null,null,null,null,null,null,null,"Documentado ","Aplicación ","Efectivo","Seguimiento, evaluación y mejora "]
[null,null,null,{"$f":"IF(B11=\"\",\"-\",VLOOKUP(B11,Datos!$B$3:$C$25,2,FALSE))","v":"-"},null,null,null,null,null,null,null,{"$f":"IF(AND(J11=Datos!$B$186,K11=Datos!$B$193),Datos!$D$186,IF(AND(J11=Datos!$B$186,K11=Datos!$B$194),Datos!$E$186,IF(AND(J11=Datos!$B$186,K11=Datos!$B$195),Datos!$F$186,IF(AND(J11=Datos!$B$186,K11=Datos!$B$196),Datos!$G$186,IF(AND(J11=Datos!$B$186,K11=Datos!$B$197),Datos!$H$186,IF(AND(J11=Datos!$B$187,K11=Datos!$B$193),Datos!$D$187,IF(AND(J11=Datos!$B$187,K11=Datos!$B$194),Datos!$E$187,IF(AND(J11=Datos!$B$187,K11=Datos!$B$195),Datos!$F$187,IF(AND(J11=Datos!$B$187,K11=Datos!$B$196),Datos!$G$187,IF(AND(J11=Datos!$B$187,K11=Datos!$B$197),Datos!$H$187,IF(AND(J11=Datos!$B$188,K11=Datos!$B$193),Datos!$D$188,IF(AND(J11=Datos!$B$188,K11=Datos!$B$194),Datos!$E$188,IF(AND(J11=Datos!$B$188,K11=Datos!$B$195),Datos!$F$188,IF(AND(J11=Datos!$B$188,K11=Datos!$B$196),Datos!$G$188,IF(AND(J11=Datos!$B$188,K11=Datos!$B$197),Datos!$H$188,IF(AND(J11=Datos!$B$189,K11=Datos!$B$193),Datos!$D$189,IF(AND(J11=Datos!$B$189,K11=Datos!$B$194),Datos!$E$189,IF(AND(J11=Datos!$B$189,K11=Datos!$B$195),Datos!$F$189,IF(AND(J11=Datos!$B$189,K11=Datos!$B$196),Datos!$G$189,IF(AND(J11=Datos!$B$189,K11=Datos!$B$197),Datos!$H$189,IF(AND(J11=Datos!$B$190,K11=Datos!$B$193),Datos!$D$190,IF(AND(J11=Datos!$B$190,K11=Datos!$B$194),Datos!$E$190,IF(AND(J11=Datos!$B$190,K11=Datos!$B$195),Datos!$F$190,IF(AND(J11=Datos!$B$190,K11=Datos!$B$196),Datos!$G$190,IF(AND(J11=Datos!$B$190,K11=Datos!$B$197),Datos!$H$190,\"-\")))))))))))))))))))))))))","v":"-"},null,null,null,null,null,null,null,null,null,null,{"$f":"((IF(S11=Datos!$B$83,0,IF(S11=Datos!$B$84,5,IF(S11=Datos!$B$85,10,IF(S11=Datos!$B$86,15,IF(S11=Datos!$B$87,20,IF(S11=Datos!$B$88,25,0)))))))/100)+((IF(T11=Datos!$B$83,0,IF(T11=Datos!$B$84,5,IF(T11=Datos!$B$85,10,IF(T11=Datos!$B$86,15,IF(T11=Datos!$B$87,20,IF(T11=Datos!$B$88,25,0)))))))/100)+((IF(U11=Datos!$B$83,0,IF(U11=Datos!$B$84,5,IF(U11=Datos!$B$85,10,IF(U11=Datos!$B$86,15,IF(U11=Datos!$B$87,20,IF(U11=Datos!$B$88,25,0)))))))/100)+((IF(V11=Datos!$B$83,0,IF(V11=Datos!$B$84,5,IF(V11=Datos!$B$85,10,IF(V11=Datos!$B$86,15,IF(V11=Datos!$B$87,20,IF(V11=Datos!$B$88,25,0)))))))/100)","v":0},{"$f":"IF(R11=\"\",\"-\",(IF(J11=\"\",\"-\",(IF(R11=Datos!$B$201,(IF(J11=Datos!$B$186,Datos!$B$186,IF(AND(J11=Datos!$B$187,W11>0.49),Datos!$B$186,IF(AND(J11=Datos!$B$188,W11>0.74),Datos!$B$186,IF(AND(J11=Datos!$B$188,W11<0.75,W11>0.49),Datos!$B$187,IF(AND(J11=Datos!$B$189,W11>0.74),Datos!$B$187,IF(AND(J11=Datos!$B$189,W11<0.75,W11>0.49),Datos!$B$188,IF(AND(J11=Datos!$B$190,W11>0.74),Datos!$B$188,IF(AND(J11=Datos!$B$190,W11<0.75,W11>0.49),Datos!$B$189,J11))))))))),J11)))))","v":"-"},{"$f":"IF(R11=\"\",\"-\",(IF(K11=\"\",\"-\",(IF(R11=Datos!$B$200,(IF(K11=Datos!$B$193,Datos!$B$193,IF(AND(K11=Datos!$B$194,W11>0.49),Datos!$B$193,IF(AND(K11=Datos!$B$195,W11>0.74),Datos!$B$193,IF(AND(K11=Datos!$B$195,W11<0.75,W11>0.49),Datos!$B$194,IF(AND(K11=Datos!$B$196,W11>0.74),Datos!$B$194,IF(AND(K11=Datos!$B$196,W11<0.75,W11>0.49),Datos!$B$195,IF(AND(K11=Datos!$B$197,W11>0.74),Datos!$B$195,IF(AND(K11=Datos!$B$197,W11<0.75,W11>0.49),Datos!$B$196,K11))))))))),K11)))))","v":"-"},{"$f":"IF(AND(X11=Datos!$B$186,Y11=Datos!$B$193),Datos!$D$186,IF(AND(X11=Datos!$B$186,Y11=Datos!$B$194),Datos!$E$186,IF(AND(X11=Datos!$B$186,Y11=Datos!$B$195),Datos!$F$186,IF(AND(X11=Datos!$B$186,Y11=Datos!$B$196),Datos!$G$186,IF(AND(X11=Datos!$B$186,Y11=Datos!$B$197),Datos!$H$186,IF(AND(X11=Datos!$B$187,Y11=Datos!$B$193),Datos!$D$187,IF(AND(X11=Datos!$B$187,Y11=Datos!$B$194),Datos!$E$187,IF(AND(X11=Datos!$B$187,Y11=Datos!$B$195),Datos!$F$187,IF(AND(X11=Datos!$B$187,Y11=Datos!$B$196),Datos!$G$187,IF(AND(X11=Datos!$B$187,Y11=Datos!$B$197),Datos!$H$187,IF(AND(X11=Datos!$B$188,Y11=Datos!$B$193),Datos!$D$188,IF(AND(X11=Datos!$B$188,Y11=Datos!$B$194),Datos!$E$188,IF(AND(X11=Datos!$B$188,Y11=Datos!$B$195),Datos!$F$188,IF(AND(X11=Datos!$B$188,Y11=Datos!$B$196),Datos!$G$188,IF(AND(X11=Datos!$B$188,Y11=Datos!$B$197),Datos!$H$188,IF(AND(X11=Datos!$B$189,Y11=Datos!$B$193),Datos!$D$189,IF(AND(X11=Datos!$B$189,Y11=Datos!$B$194),Datos!$E$189,IF(AND(X11=Datos!$B$189,Y11=Datos!$B$195),Datos!$F$189,IF(AND(X11=Datos!$B$189,Y11=Datos!$B$196),Datos!$G$189,IF(AND(X11=Datos!$B$189,Y11=Datos!$B$197),Datos!$H$189,IF(AND(X11=Datos!$B$190,Y11=Datos!$B$193),Datos!$D$190,IF(AND(X11=Datos!$B$190,Y11=Datos!$B$194),Datos!$E$190,IF(AND(X11=Datos!$B$190,Y11=Datos!$B$195),Datos!$F$190,IF(AND(X11=Datos!$B$190,Y11=Datos!$B$196),Datos!$G$190,IF(AND(X11=Datos!$B$190,Y11=Datos!$B$197),Datos!$H$190,\"-\")))))))))))))))))))))))))","v":"-"}]

{"sheet":"Riesgos de Corrupción","index":6,"n_rows":11,"n_cols":16,"rows_kept":11,"cut":false,"hidden":false,"merged":[[8,15,9,15],[10,1,10,2],[10,4,10,5],[8,8,9,8],[8,9,9,9],[8,14,9,14],[7,6,9,6],[7,7,9,7],[7,1,9,2],[7,3,9,3],[7,4,9,5],[7,8,7,9],[7,10,7,12],[7,13,7,15],[8,10,8,11],[8,12,9,12],[8,13,9,13],[1,1,3,1],[1,2,1,3],[1,5,3,5],[2,2,2,3],[3,2,3,3]]}
[]
[null,null,"MATRIZ INTEGRAL DE RIESGOS ",null,"Código: GI-GUI-002-FR-001"]
[null,null,"Macroproceso: Direccionamiento Estratégico",null,"Versión: 01"]
[null,null,"Proceso: Gestión Integrada",null,"Fecha de Aprobación: XX/XX/XX"]
[]
[null,null,"Riesgos de Corrupción"]
[]
[null,"PROCESO",null,"OBJETIVO DEL PROCESO  ","CAUSAS",null,"RIESGO","DESCRIPCIÓN","ANÁLISIS ",null,"MEDIDAS DE MITIGACIÓN",null,null,"SEGUIMIENTO"]
[null,null,null,null,null,null,null,null,"PROBABILIDAD DE MATERIALIZACIÓN","IMPACTO","VALORACIÓN",null,"ADMINISTRACIÓN DEL RIESGO","ACCIONES","RESPONSABLE","INDICADOR"]
[null,null,null,null,null,null,null,null,null,null,"TIPO DE CONTROL","DESCRIPCIÓN"]
[null,null,null,{"$f":"IF(B11=\"\",\"-\",VLOOKUP(B11,Datos!$B$3:$C$25,2,FALSE))","v":"-"},null,null,null,null,null,"Único"]

{"sheet":"Clasificación del Riesgo","index":7,"n_rows":14,"n_cols":5,"rows_kept":14,"cut":false,"hidden":false,"merged":[[9,1,9,2],[1,2,1,3],[2,2,2,3],[3,2,3,3],[7,3,7,5],[6,1,6,2],[6,3,6,5],[8,3,8,5],[7,1,7,2],[8,1,8,2],[9,3,9,5],[1,1,3,1],[1,5,3,5],[10,3,10,5],[11,3,11,5],[12,3,12,5],[13,3,13,5],[12,1,12,2],[13,1,13,2],[10,1,10,2],[11,1,11,2]]}
[]
[null,null,"MATRIZ INTEGRAL DE RIESGOS ",null,"Código: GI-GUI-002-FR-001"]
[null,null,"Macroproceso: Direccionamiento Estratégico",null,"Versión: 01"]
[null,null,"Proceso: Gestión Integrada",null,"Fecha de Aprobación: XX/XX/XX"]
[]
[]
[null,"Clasificación del Riesgo",null,"DESCRIPCION"]
[null,"ESTRATÉGICO",null,"Se asocia con la forma en que se administra la Entidad. Se enfoca a asuntos globales relacionados con la misión y el cumplimiento de los objetivos estratégicos, la clara definición de políticas, diseño y conceptualización de la entidad por parte de la alta gerencia."]
[null,"IMAGEN",null,"Están relacionados con la percepción y la confianza por parte de la ciudadanía hacia la institución."]
[null,"OPERATIVOS",null,"Comprenden riesgos provenientes del funcionamiento y operatividad de los sistemas de información institucional, de la definición de los procesos, de la estructura de la entidad, de la articulación entre dependencias."]
[null,"FINANCIEROS",null,"Se relacionan con el manejo de los recursos de la entidad que incluyen: la ejecución presupuestal, la elaboración de los estados financieros, los pagos, manejos de excedentes de tesorería y el manejo sobre los bienes."]
[null,"DE CUMPLIMIENTO",null,"Se asocian con la capacidad de la entidad para cumplir con los requisitos legales, contractuales, de ética pública y en general con su compromiso ante la comunidad."]
[null,"DE TECNOLOGÍA",null,"Están relacionados con la capacidad tecnológica de la Entidad para satisfacer sus necesidades actuales y futuras y el cumplimiento de la misión."]
[null,"DE CORRUPCIÓN",null,"El riesgo de corrupción es la posibilidad de ocurrencia de una conducta o comportamiento que puede derivar en una actuación corrupta"]

{"sheet":"Calificación del Control","index":8,"n_rows":20,"n_cols":8,"rows_kept":20,"cut":false,"hidden":false,"merged":[[15,1,15,2],[16,1,16,2],[17,1,17,2],[18,1,18,2],[19,1,19,2],[14,1,14,7],[11,2,11,3],[12,1,12,7],[6,1,6,7],[7,4,7,5],[8,4,8,5],[9,4,9,5],[10,4,10,5],[11,4,11,5],[10,2,10,3],[7,2,7,3],[8,2,8,3],[9,2,9,3],[1,1,3,1],[1,6,3,6],[1,2,1,4],[2,2,2,4],[3,2,3,4]]}
[]
[null,null,"MATRIZ INTEGRAL DE RIESGOS ",null,null,"Código: GI-GUI-002-FR-001"]
[null,null,"Macroproceso: Direccionamiento Estratégico",null,null,"Versión: 01"]
[null,null,"Proceso: Gestión Integrada",null,null,"Fecha de Aprobación: XX/XX/XX"]
[]
[]
[null,"CALIFICACIÓN DEL CONTROL"]
[null,"CALIFICACIÓN","CRITERIOS",null,"EVALUACIÓN  DEL RIESGO",null,"CUADRANTES A DISMINUIR EN LA PROBABILIDAD","CUADRANTES A DISMINUIR EN EL IMPACTO"]
[null,"75% - 100%","Los controles son efectivos y están documentados.",null,"Pasa a dos Casillas inferior (el desplazamiento depende de sí el control afecta el impacto o la probabilidad).",null,2,2]
[null,"50 % - 75%","Los controles existen, son efectivos pero no están documentados.",null,"Cambia el resultado a una casilla inferior de la matriz de evaluación antes del tratamiento (el desplazamiento depende de sí el control afecta el impacto o la probabilidad ).",null,1,1]
[null,"50% - 25%","Los controles existen , no son efectivos.",null,"Se mantiene el resultado de la evaluación antes de tratamiento.",null,0,0]
[null,"25% - 0%","No existen controles.",null,"Se mantiene el resultado de la evaluación antes del tratamiento.",null,0,0]
[null,"DEPENDIENDO SI EL CONTROL AFECTA A LA PROBABILIDAD O AL IMPACTO SE DESPLAZA EN LA TABLA DE CALIFICACION:\nLOS CONTROLES PREVENTIVOS AFECTAN LA PROBABILIDAD MIENTRAS QUE LOS CORRECTIVOS AFECTAN EL IMPACTO."]
[]
[null,"ESCALAS DE CALIFICACIÓN"]
[null,"CRITERIOS DE CALIFICACIÓN",null,"NULO","BAJO","MEDIO BAJO","MEDIO ALTO","ALTO"]
[null,"Nivel de Documentación",null,0,"(1-5)","(6-15)","(16-20)","(21-25)"]
[null,"Nivel de Aplicación del Control",null,0,"(1-5)","(6-15)","(16-20)","(21-25)"]
[null,"Nivel de Efectividad",null,0,"(1-5)","(6-15)","(16-20)","(21-25)"]
[null,"Nivel de Seguimiento, Evaluación y Mejora",null,0,"(1-5)","(6-15)","(16-20)","(21-25)"]